gump-general mailing list archives

Site index · List index
Message view « Date » · « Thread »
Top « Date » · « Thread »
From g...@vmgump-vm3.apache.org
Subject BATCH: All dressed up, with nowhere to go...
Date Fri, 16 Feb 2018 05:07:14 GMT
Dear Gumpmeisters,
            
The following 8 notifys should have been sent

*********************************************************** G U M P
[GUMP@vmgump-vm3]: Module ant-contrib failed
[GUMP@vmgump-vm3]: Project bcel (in module ant-contrib) failed
[GUMP@vmgump-vm3]: Project ant-contrib-private-ivy2 (in module ant-contrib) failed
[GUMP@vmgump-vm3]: Project ant-contrib-private-ivy (in module ant-contrib) failed
[GUMP@vmgump-vm3]: Project ant-contrib (in module ant-contrib) failed
[GUMP@vmgump-vm3]: Project compress-antlib-test (in module antlibs-compress) failed
[GUMP@vmgump-vm3]: Project commons-beanutils (in module apache-commons) failed
[GUMP@vmgump-vm3]: Project test-ant (in module ant) failed
*********************************************************** G U M P
[GUMP@vmgump-vm3]: Module ant-contrib failed
To whom it may engage...
        
This is an automated request, but not an unsolicited one. For 
more information please visit http://gump.apache.org/nagged.html, 
and/or contact the folk at general@gump.apache.org.

Module ant-contrib has an issue affecting its community integration,
 and has been outstanding for 560 runs.
The current state of this module is 'Failed', with reason 'Update Failed'.

Full details are available at:
    http://vmgump-vm3.apache.org/ant-contrib/index.html

That said, some information snippets are provided here.

The following annotations (debug/informational/warning/error messages) were provided:
 -INFO- Failed with reason update failed



The following work was performed:
http://vmgump-vm3.apache.org/ant-contrib/gump_work/update_ant-contrib.html
Work Name: update_ant-contrib (Type: Update)
Work ended in a state of : Failed
Elapsed: 2 mins 7 secs
Command Line: svn --quiet update --non-interactive ant-contrib 
[Working Directory: /srv/gump/public/workspace/cvs]
---------------------------------------------
svn: E000110: Unable to connect to a repository at URL 'http://svn.code.sf.net/p/ant-contrib/code/ant-contrib/trunk'
svn: E000110: Error running context: Connection timed out
---------------------------------------------

To subscribe to this information via syndicated feeds:
- RSS: http://vmgump-vm3.apache.org/ant-contrib/rss.xml
- Atom: http://vmgump-vm3.apache.org/ant-contrib/atom.xml

============================== Gump Tracking Only ===
Produced by Apache Gump(TM) version 2.3.
Gump Run 20180216000009, vmgump-vm3.apache.org:vmgump:20180216000009
Gump E-mail Identifier (unique within run) #1.

*********************************************************** G U M P
[GUMP@vmgump-vm3]: Project bcel (in module ant-contrib) failed
To whom it may engage...
        
This is an automated request, but not an unsolicited one. For 
more information please visit http://gump.apache.org/nagged.html, 
and/or contact the folk at general@gump.apache.org.

Project bcel has an issue affecting its community integration,
 and has been outstanding for 560 runs.
The current state of this project is 'Failed', with reason 'Update Failed'.

Full details are available at:
    http://vmgump-vm3.apache.org/ant-contrib/bcel/index.html

That said, some information snippets are provided here.

The following annotations (debug/informational/warning/error messages) were provided:
 -DEBUG- Sole jar output [bcel-5.1.jar] identifier set to project name
 -INFO- Failed with reason update failed
 -DEBUG- Extracted fallback artifacts from Gump Repository

To subscribe to this information via syndicated feeds:
- RSS: http://vmgump-vm3.apache.org/ant-contrib/bcel/rss.xml
- Atom: http://vmgump-vm3.apache.org/ant-contrib/bcel/atom.xml

============================== Gump Tracking Only ===
Produced by Apache Gump(TM) version 2.3.
Gump Run 20180216000009, vmgump-vm3.apache.org:vmgump:20180216000009
Gump E-mail Identifier (unique within run) #2.

*********************************************************** G U M P
[GUMP@vmgump-vm3]: Project ant-contrib-private-ivy2 (in module ant-contrib) failed
To whom it may engage...
        
This is an automated request, but not an unsolicited one. For 
more information please visit http://gump.apache.org/nagged.html, 
and/or contact the folk at general@gump.apache.org.

Project ant-contrib-private-ivy2 has an issue affecting its community integration,
 and has been outstanding for 560 runs.
The current state of this project is 'Failed', with reason 'Update Failed'.

Full details are available at:
    http://vmgump-vm3.apache.org/ant-contrib/ant-contrib-private-ivy2/index.html

That said, some information snippets are provided here.

The following annotations (debug/informational/warning/error messages) were provided:
 -DEBUG- Sole jar output [ivy-2.0.0.jar] identifier set to project name
 -INFO- Failed with reason update failed
 -DEBUG- Extracted fallback artifacts from Gump Repository

To subscribe to this information via syndicated feeds:
- RSS: http://vmgump-vm3.apache.org/ant-contrib/ant-contrib-private-ivy2/rss.xml
- Atom: http://vmgump-vm3.apache.org/ant-contrib/ant-contrib-private-ivy2/atom.xml

============================== Gump Tracking Only ===
Produced by Apache Gump(TM) version 2.3.
Gump Run 20180216000009, vmgump-vm3.apache.org:vmgump:20180216000009
Gump E-mail Identifier (unique within run) #3.

*********************************************************** G U M P
[GUMP@vmgump-vm3]: Project ant-contrib-private-ivy (in module ant-contrib) failed
To whom it may engage...
        
This is an automated request, but not an unsolicited one. For 
more information please visit http://gump.apache.org/nagged.html, 
and/or contact the folk at general@gump.apache.org.

Project ant-contrib-private-ivy has an issue affecting its community integration,
 and has been outstanding for 560 runs.
The current state of this project is 'Failed', with reason 'Update Failed'.

Full details are available at:
    http://vmgump-vm3.apache.org/ant-contrib/ant-contrib-private-ivy/index.html

That said, some information snippets are provided here.

The following annotations (debug/informational/warning/error messages) were provided:
 -DEBUG- Sole jar output [ivy-1.4.1.jar] identifier set to project name
 -INFO- Failed with reason update failed
 -DEBUG- Extracted fallback artifacts from Gump Repository

To subscribe to this information via syndicated feeds:
- RSS: http://vmgump-vm3.apache.org/ant-contrib/ant-contrib-private-ivy/rss.xml
- Atom: http://vmgump-vm3.apache.org/ant-contrib/ant-contrib-private-ivy/atom.xml

============================== Gump Tracking Only ===
Produced by Apache Gump(TM) version 2.3.
Gump Run 20180216000009, vmgump-vm3.apache.org:vmgump:20180216000009
Gump E-mail Identifier (unique within run) #4.

*********************************************************** G U M P
[GUMP@vmgump-vm3]: Project ant-contrib (in module ant-contrib) failed
To whom it may engage...
        
This is an automated request, but not an unsolicited one. For 
more information please visit http://gump.apache.org/nagged.html, 
and/or contact the folk at general@gump.apache.org.

Project ant-contrib has an issue affecting its community integration,
 and has been outstanding for 282 runs.
The current state of this project is 'Failed', with reason 'Update Failed'.

Full details are available at:
    http://vmgump-vm3.apache.org/ant-contrib/ant-contrib/index.html

That said, some information snippets are provided here.

The following annotations (debug/informational/warning/error messages) were provided:
 -INFO- Failed with reason update failed
 -DEBUG- Extracted fallback artifacts from Gump Repository

To subscribe to this information via syndicated feeds:
- RSS: http://vmgump-vm3.apache.org/ant-contrib/ant-contrib/rss.xml
- Atom: http://vmgump-vm3.apache.org/ant-contrib/ant-contrib/atom.xml

============================== Gump Tracking Only ===
Produced by Apache Gump(TM) version 2.3.
Gump Run 20180216000009, vmgump-vm3.apache.org:vmgump:20180216000009
Gump E-mail Identifier (unique within run) #5.

*********************************************************** G U M P
[GUMP@vmgump-vm3]: Project compress-antlib-test (in module antlibs-compress) failed
To whom it may engage...
        
This is an automated request, but not an unsolicited one. For 
more information please visit http://gump.apache.org/nagged.html, 
and/or contact the folk at general@gump.apache.org.

Project compress-antlib-test has an issue affecting its community integration.
This issue affects 1 projects,
 and has been outstanding for 36 runs.
The current state of this project is 'Failed', with reason 'Build Failed'.
For reference only, the following projects are affected by this:
    - compress-antlib-test :  The Apache Compress Antlib contains tasks and resources that...


Full details are available at:
    http://vmgump-vm3.apache.org/antlibs-compress/compress-antlib-test/index.html

That said, some information snippets are provided here.

The following annotations (debug/informational/warning/error messages) were provided:
 -DEBUG- Dependency on ant exists, no need to add for property ant.home.
 -INFO- Failed with reason build failed



The following work was performed:
http://vmgump-vm3.apache.org/antlibs-compress/compress-antlib-test/gump_work/build_antlibs-compress_compress-antlib-test.html
Work Name: build_antlibs-compress_compress-antlib-test (Type: Build)
Work ended in a state of : Failed
Elapsed: 3 mins 48 secs
Command Line: /usr/lib/jvm/java-8-oracle/bin/java -Djava.awt.headless=true -Dbuild.sysclasspath=only
-Xbootclasspath/p:/srv/gump/public/workspace/xml-xerces2/build/xercesImpl.jar:/srv/gump/public/workspace/xml-commons/java/external/build/xml-apis.jar
org.apache.tools.ant.Main -Dgump.merge=/srv/gump/public/gump/work/merge.xml -Dant.home=/srv/gump/public/workspace/ant/dist
test 
[Working Directory: /srv/gump/public/workspace/antlibs-compress]
CLASSPATH: /usr/lib/jvm/java-8-oracle/lib/tools.jar:/srv/gump/public/workspace/antlibs-compress/ivy/ivy.jar:/srv/gump/public/workspace/antlibs-compress/build/ant-compress-20180216.jar:/srv/gump/public/workspace/ant/dist/lib/ant.jar:/srv/gump/public/workspace/ant/dist/lib/ant-launcher.jar:/srv/gump/public/workspace/ant/dist/lib/ant-jmf.jar:/srv/gump/public/workspace/ant/dist/lib/ant-junit.jar:/srv/gump/public/workspace/ant/dist/lib/ant-junit4.jar:/srv/gump/public/workspace/ant/dist/lib/ant-swing.jar:/srv/gump/public/workspace/ant/dist/lib/ant-apache-resolver.jar:/srv/gump/public/workspace/ant/dist/lib/ant-apache-xalan2.jar:/srv/gump/public/workspace/commons-compress/target/commons-compress-1.17-SNAPSHOT.jar:/srv/gump/public/workspace/xz-java/build/jar-20180216/xz.jar:/srv/gump/public/workspace/brotli/java/org/brotli/dec/target/dec-0.2.0-SNAPSHOT.jar:/srv/gump/public/workspace/antlibs-antunit/build/ant-antunit-20180216.jar:/srv/gump/public/workspace/xml-commons/java/external/build/xml-
 apis-ext.jar
---------------------------------------------
[au:antunit] Tests run: 3, Failures: 0, Errors: 0, Time elapsed: 0.056 sec
[au:antunit] Target: testResourceProperties took 0.018 sec
[au:antunit] Target: testUncompressSource took 0.017 sec
[au:antunit] Target: testZipSource took 0.015 sec
[au:antunit] Build File: /srv/gump/public/workspace/antlibs-compress/src/tests/antunit/zipfileset-test.xml
[au:antunit] Tests run: 9, Failures: 0, Errors: 0, Time elapsed: 0.083 sec
[au:antunit] Target: testMissingArchiveDoesntMatter took 0.005 sec
[au:antunit] Target: test-refid-check-encoding took 0.004 sec
[au:antunit] Target: test-refid-check-prefix took 0.005 sec
[au:antunit] Target: testMissingArchive took 0.004 sec
[au:antunit] Target: testFailsOnUnreadableEntries took 0.006 sec
[au:antunit] Target: testZipSource took 0.005 sec
[au:antunit] Target: test-refid-modify took 0.03 sec
[au:antunit] Target: testUncompressSource took 0.005 sec
[au:antunit] Target: testSkipUnreadableEntries took 0.004 sec
[au:antunit] Build File: /srv/gump/public/workspace/antlibs-compress/src/tests/antunit/zresource-test.xml
[au:antunit] Tests run: 1, Failures: 0, Errors: 0, Time elapsed: 0.01 sec
[au:antunit] Target: testNativeZ took 0.009 sec
[au:antunit] Build File: /srv/gump/public/workspace/antlibs-compress/src/tests/antunit/zstd-test.xml
[au:antunit] Tests run: 8, Failures: 0, Errors: 3, Time elapsed: 0.052 sec
[au:antunit] Target: testNestedTask  caused an ERROR
[au:antunit] 	at line 91, column 54
[au:antunit] 	Message: java.lang.NoClassDefFoundError: com/github/luben/zstd/ZstdOutputStream
[au:antunit] 	took 0.006 sec
[au:antunit] Target: testFailTwo took 0.005 sec
[au:antunit] Target: testRealTestWithResource  caused an ERROR
[au:antunit] 	at line 76, column 54
[au:antunit] 	Message: java.lang.NoClassDefFoundError: com/github/luben/zstd/ZstdOutputStream
[au:antunit] 	took 0.005 sec
[au:antunit] Target: testFailTwoDests took 0.005 sec
[au:antunit] Target: testRealTest  caused an ERROR
[au:antunit] 	at line 70, column 56
[au:antunit] 	Message: java.lang.NoClassDefFoundError: com/github/luben/zstd/ZstdOutputStream
[au:antunit] 	took 0.005 sec
[au:antunit] Target: testFailNone took 0.004 sec
[au:antunit] Target: testDateCheck took 0.005 sec
[au:antunit] Target: testFailNoDest took 0.004 sec
[au:antunit] Build File: /srv/gump/public/workspace/antlibs-compress/src/tests/antunit/zstdresource-test.xml
[au:antunit] Tests run: 1, Failures: 0, Errors: 1, Time elapsed: 0.008 sec
[au:antunit] Target: testNativeZstd  caused an ERROR
[au:antunit] 	at line 31, column 29
[au:antunit] 	Message: java.lang.NoClassDefFoundError: com/github/luben/zstd/ZstdInputStream
[au:antunit] 	took 0.008 sec

test:

BUILD FAILED
/srv/gump/public/workspace/antlibs-compress/common/build.xml:209: At least one AntUnit test
has failed.

Total time: 3 minutes 47 seconds
---------------------------------------------

To subscribe to this information via syndicated feeds:
- RSS: http://vmgump-vm3.apache.org/antlibs-compress/compress-antlib-test/rss.xml
- Atom: http://vmgump-vm3.apache.org/antlibs-compress/compress-antlib-test/atom.xml

============================== Gump Tracking Only ===
Produced by Apache Gump(TM) version 2.3.
Gump Run 20180216000009, vmgump-vm3.apache.org:vmgump:20180216000009
Gump E-mail Identifier (unique within run) #6.

*********************************************************** G U M P
[GUMP@vmgump-vm3]: Project commons-beanutils (in module apache-commons) failed
To whom it may engage...
        
This is an automated request, but not an unsolicited one. For 
more information please visit http://gump.apache.org/nagged.html, 
and/or contact the folk at general@gump.apache.org.

Project commons-beanutils has an issue affecting its community integration.
This issue affects 7 projects,
 and has been outstanding for 174 runs.
The current state of this project is 'Failed', with reason 'Build Failed'.
For reference only, the following projects are affected by this:
    - checkstyle :  Java style checker
    - commons-beanutils :  Bean Utilities
    - commons-digester :  XML to Java Object Configuration
    - tomcat-tc7.0.x-validate :  Tomcat 7.x, a web server implementing Java Servlet 3.0,
    ...
    - tomcat-tc8.0.x-validate :  Tomcat 8.x, a web server implementing the Java Servlet 3.1,
...
    - tomcat-trunk-validate :  Tomcat 9.x, a web server implementing the Java Servlet 4.0,
...
    - xmlgraphics-commons-test :  Apache XML Graphics Commons - Common Components for Batik
an...


Full details are available at:
    http://vmgump-vm3.apache.org/apache-commons/commons-beanutils/index.html

That said, some information snippets are provided here.

The following annotations (debug/informational/warning/error messages) were provided:
 -DEBUG- Sole pom output [pom.xml] identifier set to project name
 -DEBUG- Dependency on junit exists, no need to add for property junit.home.
 -INFO- Failed with reason build failed
 -INFO- Failed to extract fallback artifacts from Gump Repository



The following work was performed:
http://vmgump-vm3.apache.org/apache-commons/commons-beanutils/gump_work/build_apache-commons_commons-beanutils.html
Work Name: build_apache-commons_commons-beanutils (Type: Build)
Work ended in a state of : Failed
Elapsed: 3 secs
Command Line: /usr/lib/jvm/java-8-oracle/bin/java -Djava.awt.headless=true -Dbuild.sysclasspath=only
-Xbootclasspath/p:/srv/gump/public/workspace/xml-xerces2/build/xercesImpl.jar:/srv/gump/public/workspace/xml-commons/java/external/build/xml-apis.jar
org.apache.tools.ant.Main -Dgump.merge=/srv/gump/public/gump/work/merge.xml -Djunit.home=/srv/gump/public/workspace/junit
-Dcomponent.version=20180216 jar 
[Working Directory: /srv/gump/public/workspace/apache-commons/beanutils]
CLASSPATH: /usr/lib/jvm/java-8-oracle/lib/tools.jar:/srv/gump/public/workspace/apache-commons/beanutils/target/classes:/srv/gump/public/workspace/ant/dist/lib/ant.jar:/srv/gump/public/workspace/ant/dist/lib/ant-launcher.jar:/srv/gump/public/workspace/ant/dist/lib/ant-jmf.jar:/srv/gump/public/workspace/ant/dist/lib/ant-junit.jar:/srv/gump/public/workspace/ant/dist/lib/ant-junit4.jar:/srv/gump/public/workspace/ant/dist/lib/ant-swing.jar:/srv/gump/public/workspace/ant/dist/lib/ant-apache-resolver.jar:/srv/gump/public/workspace/ant/dist/lib/ant-apache-xalan2.jar:/srv/gump/public/workspace/xml-commons/java/build/resolver.jar:/srv/gump/public/workspace/xml-commons/java/external/build/xml-apis-ext.jar:/srv/gump/public/workspace/apache-commons/logging/target/commons-logging-20180216.jar:/srv/gump/public/workspace/apache-commons/logging/target/commons-logging-api-20180216.jar:/srv/gump/packages/commons-collections3/commons-collections-3.2.1.jar:/srv/gump/public/workspace/junit/target/junit-4.
 13-SNAPSHOT.jar
---------------------------------------------
    [javac]   symbol:   class Transformer
    [javac]   location: class BeanMap
    [javac] /srv/gump/public/workspace/apache-commons/beanutils/src/main/java/org/apache/commons/beanutils2/BeanMap.java:200:
error: cannot find symbol
    [javac]             new Transformer() {
    [javac]                 ^
    [javac]   symbol:   class Transformer
    [javac]   location: class BeanMap
    [javac] /srv/gump/public/workspace/apache-commons/beanutils/src/main/java/org/apache/commons/beanutils2/BeanMap.java:623:
error: incompatible types: org.apache.commons.beanutils2.BeanMap.Entry cannot be converted
to java.util.Map.Entry<Object,Object>
    [javac]                 Map.Entry<Object, Object> tmpEntry = new Entry( BeanMap.this,
key, value );
    [javac]                                                      ^
    [javac] /srv/gump/public/workspace/apache-commons/beanutils/src/main/java/org/apache/commons/beanutils2/BeanMap.java:790:
error: method does not override or implement a method from a supertype
    [javac]         @Override
    [javac]         ^
    [javac] /srv/gump/public/workspace/apache-commons/beanutils/src/main/java/org/apache/commons/beanutils2/BeanMap.java:792:
error: cannot find symbol
    [javac]             final Object key = getKey();
    [javac]                                ^
    [javac]   symbol:   method getKey()
    [javac]   location: class Entry
    [javac] /srv/gump/public/workspace/apache-commons/beanutils/src/main/java/org/apache/commons/beanutils2/BeanMap.java:797:
error: non-static variable super cannot be referenced from a static context
    [javac]             super.setValue( newValue );
    [javac]             ^
    [javac] /srv/gump/public/workspace/apache-commons/beanutils/src/main/java/org/apache/commons/beanutils2/BeanMap.java:797:
error: cannot find symbol
    [javac]             super.setValue( newValue );
    [javac]                  ^
    [javac]   symbol: method setValue(Object)
    [javac] /srv/gump/public/workspace/apache-commons/beanutils/src/main/java/org/apache/commons/beanutils2/BeanMap.java:891:
error: cannot find symbol
    [javac]             final Transformer transformer = getTypeTransformer( newType );
    [javac]                   ^
    [javac]   symbol:   class Transformer
    [javac]   location: class BeanMap
    [javac] /srv/gump/public/workspace/apache-commons/beanutils/src/main/java/org/apache/commons/beanutils2/BeanPredicate.java:63:
error: method does not override or implement a method from a supertype
    [javac]     @Override
    [javac]     ^
    [javac] /srv/gump/public/workspace/apache-commons/beanutils/src/main/java/org/apache/commons/beanutils2/BeanPropertyValueChangeClosure.java:161:
error: method does not override or implement a method from a supertype
    [javac]     @Override
    [javac]     ^
    [javac] /srv/gump/public/workspace/apache-commons/beanutils/src/main/java/org/apache/commons/beanutils2/BeanPropertyValueEqualsPredicate.java:195:
error: method does not override or implement a method from a supertype
    [javac]     @Override
    [javac]     ^
    [javac] /srv/gump/public/workspace/apache-commons/beanutils/src/main/java/org/apache/commons/beanutils2/BeanToPropertyValueTransformer.java:148:
error: method does not override or implement a method from a supertype
    [javac]     @Override
    [javac]     ^
    [javac] Note: Some input files use unchecked or unsafe operations.
    [javac] Note: Recompile with -Xlint:unchecked for details.
    [javac] 40 errors

BUILD FAILED
/srv/gump/public/workspace/apache-commons/beanutils/build.xml:151: Compile failed; see the
compiler error output for details.

Total time: 2 seconds
---------------------------------------------

To subscribe to this information via syndicated feeds:
- RSS: http://vmgump-vm3.apache.org/apache-commons/commons-beanutils/rss.xml
- Atom: http://vmgump-vm3.apache.org/apache-commons/commons-beanutils/atom.xml

============================== Gump Tracking Only ===
Produced by Apache Gump(TM) version 2.3.
Gump Run 20180216000009, vmgump-vm3.apache.org:vmgump:20180216000009
Gump E-mail Identifier (unique within run) #7.

*********************************************************** G U M P
[GUMP@vmgump-vm3]: Project test-ant (in module ant) failed
To whom it may engage...
        
This is an automated request, but not an unsolicited one. For 
more information please visit http://gump.apache.org/nagged.html, 
and/or contact the folk at general@gump.apache.org.

Project test-ant has an issue affecting its community integration.
This issue affects 1 projects,
 and has been outstanding for 174 runs.
The current state of this project is 'Failed', with reason 'Build Failed'.
For reference only, the following projects are affected by this:
    - test-ant :  Java based build tool


Full details are available at:
    http://vmgump-vm3.apache.org/ant/test-ant/index.html

That said, some information snippets are provided here.

The following annotations (debug/informational/warning/error messages) were provided:
 -WARNING- Bad *Optional* Dependency. Project: bsh : unknown to *this* workspace
 -INFO- Optional dependency xalan prerequisite failed with reason update failed
 -INFO- Failed with reason build failed



The following work was performed:
http://vmgump-vm3.apache.org/ant/test-ant/gump_work/build_ant_test-ant.html
Work Name: build_ant_test-ant (Type: Build)
Work ended in a state of : Failed
Elapsed: 11 mins 5 secs
Command Line: /usr/lib/jvm/java-8-oracle/bin/java -Djava.awt.headless=true -Dbuild.sysclasspath=only
-Xbootclasspath/p:/srv/gump/public/workspace/xml-xerces2/build/xercesImpl.jar:/srv/gump/public/workspace/xml-commons/java/external/build/xml-apis.jar:/srv/gump/public/workspace/xml-xalan/build/xalan-unbundled.jar:/srv/gump/public/workspace/xml-xalan/build/serializer.jar
org.apache.tools.ant.Main -Dgump.merge=/srv/gump/public/gump/work/merge.xml -Dtest.haltonfailure=false
-Dant.home=/srv/gump/public/workspace/ant/dist run-tests 
[Working Directory: /srv/gump/public/workspace/ant]
CLASSPATH: /usr/lib/jvm/java-8-oracle/lib/tools.jar:/srv/gump/public/workspace/ant/build/testcases:/srv/gump/public/workspace/ant/src/tests/junit:/srv/gump/public/workspace/ant/src/etc/testcases:/srv/gump/public/workspace/ant/src/etc/testcases/taskdefs/optional/out:/srv/gump/public/workspace/ant/src/tests/antunit/filters:/srv/gump/public/workspace/ant/src/tests/antunit/taskdefs/importtests:/srv/gump/public/workspace/ant/src/tests/antunit/filters/foo:/srv/gump/public/workspace/ant/src/tests/antunit/taskdefs/foo:/srv/gump/public/workspace/ant/build/antunit/tmp/testinput/build:/srv/gump/public/workspace/ant/build/antunit/tmp/testoutput:/srv/gump/public/workspace/ant/build/antunit/tmp/test.jar:/srv/gump/public/workspace/ant/build/antunit/tmp/test1.jar:/srv/gump/public/workspace/ant/build/antunit/tmp/test2.jar:/srv/gump/public/workspace/ant/build/antunit/tmp/test3.jar:/srv/gump/public/workspace/ant/build/antunit/tmp/test4.jar:/srv/gump/public/workspace/ant/build/antunit/tmp/test5.jar:/srv
 /gump/public/workspace/ant/build/antunit/tmp/resources:/srv/gump/public/workspace/ant/build/lib/ant.jar:/srv/gump/public/workspace/ant/build/lib/ant-launcher.jar:/srv/gump/public/workspace/ant/build/lib/ant-antlr.jar:/srv/gump/public/workspace/ant/build/lib/ant-apache-bcel.jar:/srv/gump/public/workspace/ant/build/lib/ant-apache-bsf.jar:/srv/gump/public/workspace/ant/build/lib/ant-apache-log4j.jar:/srv/gump/public/workspace/ant/build/lib/ant-apache-oro.jar:/srv/gump/public/workspace/ant/build/lib/ant-apache-regexp.jar:/srv/gump/public/workspace/ant/build/lib/ant-apache-resolver.jar:/srv/gump/public/workspace/ant/build/lib/ant-apache-xalan2.jar:/srv/gump/public/workspace/ant/build/lib/ant-commons-logging.jar:/srv/gump/public/workspace/ant/build/lib/ant-commons-net.jar:/srv/gump/public/workspace/ant/build/lib/ant-jai.jar:/srv/gump/public/workspace/ant/build/lib/ant-javamail.jar:/srv/gump/public/workspace/ant/build/lib/ant-jdepend.jar:/srv/gump/public/workspace/ant/build/lib/ant-jmf.jar
 :/srv/gump/public/workspace/ant/build/lib/ant-jsch.jar:/srv/gump/public/workspace/ant/build/lib/ant-junit.jar:/srv/gump/public/workspace/ant/build/lib/ant-junit4.jar:/srv/gump/public/workspace/ant/build/lib/ant-swing.jar:/srv/gump/public/workspace/ant/build/lib/ant-xz.jar:/srv/gump/packages/antlr/antlr-3.1.3.jar:bcel-gump-20180215.jar:/srv/gump/public/workspace/apache-commons/logging/target/commons-logging-20180216.jar:/srv/gump/public/workspace/apache-commons/logging/target/commons-logging-api-20180216.jar:/srv/gump/public/workspace/apache-commons/net/target/commons-net-3.7-SNAPSHOT.jar:/srv/gump/public/workspace/apache-commons/net/target/commons-net-ftp-3.7-SNAPSHOT.jar:/srv/gump/packages/jaf-1.1ea/activation.jar:/srv/gump/public/workspace/jakarta-bsf/build/lib/bsf.jar:/srv/gump/packages/apache-attic/jakarta-regexp-1.5.jar:/srv/gump/public/workspace/jakarta-servletapi-5/jsr154/dist/lib/servlet-api.jar:/srv/gump/packages/javamail-1.4/mail.jar:/srv/gump/packages/javamail-1.4/lib/mai
 lapi.jar:/srv/gump/packages/jdepend-2.6/lib/jdepend.jar:/srv/gump/packages/jsch/jsch-0.1.45.jar:/srv/gump/public/workspace/logging-log4j-12/target/log4j-1.2.18-SNAPSHOT.jar:/srv/gump/packages/apache-attic/oro-2.0.8.jar:/srv/gump/public/workspace/xz-java/build/jar-20180216/xz.jar:/srv/gump/public/workspace/antlibs-antunit/build/ant-antunit-20180216.jar:/srv/gump/packages/hamcrest/hamcrest-core-1.3.jar:/srv/gump/public/workspace/junit/target/junit-4.13-SNAPSHOT.jar:/srv/gump/public/workspace/xml-commons/java/external/build/xml-apis-ext.jar:/srv/gump/public/workspace/commons-codec-1.x/dist/commons-codec-20180216.jar
---------------------------------------------
[au:antunit] Build File: /srv/gump/public/workspace/ant/src/tests/antunit/types/selectors/modified-test.xml
[au:antunit] Tests run: 1, Failures: 0, Errors: 0, Time elapsed: 0.01 sec
[au:antunit] Target: testUpdate took 0.007 sec
[au:antunit] Build File: /srv/gump/public/workspace/ant/src/tests/antunit/types/selectors/ownedby-test.xml
[au:antunit] Tests run: 3, Failures: 0, Errors: 0, Time elapsed: 0.012 sec
[au:antunit] Target: testOwnedBy took 0.003 sec
[au:antunit] Target: testAsTrueConditions took 0 sec
[au:antunit] Target: testRequiresOwner took 0.001 sec
[au:antunit] Build File: /srv/gump/public/workspace/ant/src/tests/antunit/types/selectors/present-test.xml
[au:antunit] Tests run: 1, Failures: 0, Errors: 0, Time elapsed: 0.003 sec
[au:antunit] Target: testMapperByTypedef took 0.002 sec
[au:antunit] Build File: /srv/gump/public/workspace/ant/src/tests/antunit/types/selectors/readwrite-test.xml
[au:antunit] Tests run: 4, Failures: 0, Errors: 0, Time elapsed: 0.014 sec
[au:antunit] Target: testWritable took 0.002 sec
[au:antunit] Target: testAsConditions took 0.001 sec
[au:antunit] Target: testReadable took 0.001 sec
[au:antunit] Target: testUnwritable took 0.001 sec
[au:antunit] Build File: /srv/gump/public/workspace/ant/src/tests/antunit/types/selectors/select-test.xml
[au:antunit] Tests run: 4, Failures: 0, Errors: 0, Time elapsed: 0.105 sec
[au:antunit] Target: testIfFalse took 0.003 sec
[au:antunit] Target: testIfNotSet took 0.002 sec
[au:antunit] Target: testIfTrue took 0.002 sec
[au:antunit] Target: testIfSet took 0.002 sec
[au:antunit] Build File: /srv/gump/public/workspace/ant/src/tests/antunit/types/selectors/symlink-test.xml
[au:antunit] Tests run: 4, Failures: 0, Errors: 0, Time elapsed: 0.014 sec
[au:antunit] Target: testAsFalseConditions took 0.001 sec
[au:antunit] Target: testAsTrueConditions took 0.001 sec
[au:antunit] Target: testNoSymlink took 0.001 sec
[au:antunit] Target: testSymlink took 0.001 sec
[au:antunit] Build File: /srv/gump/public/workspace/ant/src/tests/antunit/types/tarfileset-test.xml
[au:antunit] Tests run: 3, Failures: 0, Errors: 0, Time elapsed: 0.007 sec
[au:antunit] Target: test-refid-check-encoding took 0 sec
[au:antunit] Target: testMissingArchive took 0 sec
[au:antunit] Target: testMissingArchiveDoesntMatter took 0.001 sec
[au:antunit] Build File: /srv/gump/public/workspace/ant/src/tests/antunit/types/zipfileset-test.xml
[au:antunit] Tests run: 5, Failures: 0, Errors: 0, Time elapsed: 0.02 sec
[au:antunit] Target: testMissingArchive took 0.001 sec
[au:antunit] Target: test-refid-check-encoding took 0 sec
[au:antunit] Target: test-refid-modify took 0.007 sec
[au:antunit] Target: test-refid-check-prefix took 0 sec
[au:antunit] Target: testMissingArchiveDoesntMatter took 0 sec

check-failed:

run-tests:

BUILD FAILED
/srv/gump/public/workspace/ant/build.xml:1613: Unit tests failed

Total time: 11 minutes 5 seconds
---------------------------------------------

To subscribe to this information via syndicated feeds:
- RSS: http://vmgump-vm3.apache.org/ant/test-ant/rss.xml
- Atom: http://vmgump-vm3.apache.org/ant/test-ant/atom.xml

============================== Gump Tracking Only ===
Produced by Apache Gump(TM) version 2.3.
Gump Run 20180216000009, vmgump-vm3.apache.org:vmgump:20180216000009
Gump E-mail Identifier (unique within run) #8.


--
Apache Gump
http://gump.apache.org/ [Instance: vmgump-vm3]

---------------------------------------------------------------------
To unsubscribe, e-mail: general-unsubscribe@gump.apache.org
For additional commands, e-mail: general-help@gump.apache.org


Mime
View raw message