gump-general mailing list archives

Site index · List index
Message view « Date » · « Thread »
Top « Date » · « Thread »
From g...@vmgump-vm3.apache.org
Subject BATCH: All dressed up, with nowhere to go...
Date Sun, 29 Jul 2018 22:54:40 GMT
Dear Gumpmeisters,
            
The following 1 notifys should have been sent

*********************************************************** G U M P
[GUMP@vmgump-vm3]: Project rat (in module rat) failed
*********************************************************** G U M P
[GUMP@vmgump-vm3]: Project rat (in module rat) failed
To whom it may engage...
        
This is an automated request, but not an unsolicited one. For 
more information please visit http://gump.apache.org/nagged.html, 
and/or contact the folk at general@gump.apache.org.

Project rat has an issue affecting its community integration.
This issue affects 2 projects.
The current state of this project is 'Failed', with reason 'Build Failed'.
For reference only, the following projects are affected by this:
    - forrest-rat :  Apache Forrest software is a publishing framework that trans...
    - rat :  Release Audit Tool


Full details are available at:
    http://vmgump-vm3.apache.org/rat/rat/index.html

That said, some information snippets are provided here.

The following annotations (debug/informational/warning/error messages) were provided:
 -DEBUG- (Apache Gump generated) Apache Maven Settings in: /srv/gump/public/workspace/rat/gump_mvn_settings.xml
 -INFO- Failed with reason build failed
 -DEBUG- Maven POM in: /srv/gump/public/workspace/rat/pom.xml
 -DEBUG- Extracted fallback artifacts from Gump Repository



The following work was performed:
http://vmgump-vm3.apache.org/rat/rat/gump_work/build_rat_rat.html
Work Name: build_rat_rat (Type: Build)
Work ended in a state of : Failed
Elapsed: 24 secs
Command Line: /opt/maven3/bin/mvn --batch-mode -DskipTests=true -DjavaVersion=1.8 --settings
/srv/gump/public/workspace/rat/gump_mvn_settings.xml package 
[Working Directory: /srv/gump/public/workspace/rat]
M2_HOME: /opt/maven3
---------------------------------------------
[au:antunit]   <taskdef uri="antlib:org.apache.rat.anttasks"
[au:antunit]            resource="org/apache/rat/anttasks/antlib.xml"
[au:antunit]            classpathref="all-classes-needed-for-tests"
[au:antunit]            loaderref="testloader"/>
[au:antunit] 
[au:antunit]   <target name="setUp">
[au:antunit]     <pathconvert dirsep="/" property="file.name">
[au:antunit]       <path>
[au:antunit]         <pathelement location="/srv/gump/public/workspace/rat/apache-rat-tasks/src/test/resources/antunit/report-normal-operation.xml"/>
[au:antunit]       </path>
[au:antunit] '
[au:antunit] 	took 0.059 sec
[au:antunit] Target: testWithALUnknownSentToFile took 0.06 sec
[au:antunit] Target: testWithReportSentToFile took 0.137 sec
[au:antunit] Target: testCustomMatcherSentToFile  caused an ERROR
[au:antunit] 	at line 333, column 43
[au:antunit] 	Message: Unable to find a javac compiler;
[au:antunit] com.sun.tools.javac.Main is not on the classpath.
[au:antunit] Perhaps JAVA_HOME does not point to the JDK.
[au:antunit] It is currently set to "/usr/lib/jvm/java-8-oracle/jre"
[au:antunit] 	took 0.034 sec
[INFO] ------------------------------------------------------------------------
[INFO] Reactor Summary:
[INFO] 
[INFO] Apache Creadur Rat ................................. SUCCESS [  4.244 s]
[INFO] Apache Creadur Rat::API ............................ SUCCESS [  2.445 s]
[INFO] Apache Creadur Rat::Core ........................... SUCCESS [  4.677 s]
[INFO] Apache Creadur Rat::Plugin4Maven ................... SUCCESS [  5.705 s]
[INFO] Apache Creadur Rat::Tasks4Ant ...................... FAILURE [  3.977 s]
[INFO] Apache Creadur Rat::Command Line ................... SKIPPED
[INFO] ------------------------------------------------------------------------
[INFO] BUILD FAILURE
[INFO] ------------------------------------------------------------------------
[INFO] Total time: 22.360 s
[INFO] Finished at: 2018-07-29T18:45:16+00:00
[INFO] Final Memory: 48M/362M
[INFO] ------------------------------------------------------------------------
[ERROR] Failed to execute goal org.apache.maven.plugins:maven-antrun-plugin:1.8:run (default)
on project apache-rat-tasks: An Ant BuildException has occured: The following error occurred
while executing this line:
[ERROR] /srv/gump/public/workspace/rat/apache-rat-tasks/src/test/resources/antunit/report-normal-operation.xml:59:
Tests failed with 0 failures and 6 errors
[ERROR] around Ant part ...<ant antfile="src/test/resources/antunit/report-normal-operation.xml"
inheritRefs="false" inheritAll="false">... @ 11:112 in /srv/gump/public/workspace/rat/apache-rat-tasks/target/antrun/build-main.xml
[ERROR] -> [Help 1]
[ERROR] 
[ERROR] To see the full stack trace of the errors, re-run Maven with the -e switch.
[ERROR] Re-run Maven using the -X switch to enable full debug logging.
[ERROR] 
[ERROR] For more information about the errors and possible solutions, please read the following
articles:
[ERROR] [Help 1] http://cwiki.apache.org/confluence/display/MAVEN/MojoExecutionException
[ERROR] 
[ERROR] After correcting the problems, you can resume the build with the command
[ERROR]   mvn <goals> -rf :apache-rat-tasks
---------------------------------------------

To subscribe to this information via syndicated feeds:
- RSS: http://vmgump-vm3.apache.org/rat/rat/rss.xml
- Atom: http://vmgump-vm3.apache.org/rat/rat/atom.xml

============================== Gump Tracking Only ===
Produced by Apache Gump(TM) version 2.3.
Gump Run 20180729180006, vmgump-vm3.apache.org:vmgump:20180729180006
Gump E-mail Identifier (unique within run) #1.


--
Apache Gump
http://gump.apache.org/ [Instance: vmgump-vm3]

---------------------------------------------------------------------
To unsubscribe, e-mail: general-unsubscribe@gump.apache.org
For additional commands, e-mail: general-help@gump.apache.org


Mime
View raw message