gump-general mailing list archives

Site index · List index
Message view « Date » · « Thread »
Top « Date » · « Thread »
From g...@vmgump-vm3.apache.org
Subject BATCH: All dressed up, with nowhere to go...
Date Wed, 22 May 2019 01:14:16 GMT
Dear Gumpmeisters,
            
The following 5 notifys should have been sent

*********************************************************** G U M P
[GUMP@vmgump-vm3]: Project java-hamcrest (in module java-hamcrest) failed
[GUMP@vmgump-vm3]: Project fontbox (in module pdfbox) failed
[GUMP@vmgump-vm3]: Project test-ant (in module ant) failed
[GUMP@vmgump-vm3]: Project objenesis (in module objenesis) failed
[GUMP@vmgump-vm3]: Project commons-beanutils2 (in module apache-commons) failed
*********************************************************** G U M P
[GUMP@vmgump-vm3]: Project java-hamcrest (in module java-hamcrest) failed
To whom it may engage...
        
This is an automated request, but not an unsolicited one. For 
more information please visit http://gump.apache.org/nagged.html, 
and/or contact the folk at general@gump.apache.org.

Project java-hamcrest has an issue affecting its community integration.
This issue affects 1 projects,
 and has been outstanding for 817 runs.
The current state of this project is 'Failed', with reason 'Build Failed'.
For reference only, the following projects are affected by this:
    - java-hamcrest :  Provides a library of matcher objects (also known as constra...


Full details are available at:
    http://vmgump-vm3.apache.org/java-hamcrest/java-hamcrest/index.html

That said, some information snippets are provided here.

The following annotations (debug/informational/warning/error messages) were provided:
 -DEBUG- Sole jar output [java-hamcrest-*[0-9T].jar] identifier set to project name
 -DEBUG- (Apache Gump generated) Gradle Init Script in: /srv/gump/public/workspace/java-hamcrest/gump_init_script.gradle
 -INFO- Failed with reason build failed
 -DEBUG- Gradle build in: /srv/gump/public/workspace/java-hamcrest/build.gradle
 -INFO- Failed to extract fallback artifacts from Gump Repository



The following work was performed:
http://vmgump-vm3.apache.org/java-hamcrest/java-hamcrest/gump_work/build_java-hamcrest_java-hamcrest.html
Work Name: build_java-hamcrest_java-hamcrest (Type: Build)
Work ended in a state of : Failed
Elapsed: 4 secs
Command Line: gradle --debug -Djava.awt.headless=true -Dbuild.sysclasspath=only -Dsun.zip.disableMemoryMapping=true
-Dmaven.repo.local=/srv/gump/public/workspace/mvnlocalrepo/java-hamcrest.mvnlocalrepo --refresh-dependencies
--init-script /srv/gump/public/workspace/java-hamcrest/gump_init_script.gradle build 
[Working Directory: /srv/gump/public/workspace/java-hamcrest]
---------------------------------------------
00:20:01.653 [DEBUG] [org.gradle.cache.internal.DefaultFileLockManager] Lock acquired.
00:20:01.654 [DEBUG] [org.gradle.cache.internal.DefaultPersistentDirectoryCache] Invalidating
init remapped class cache for 8q5vv4u2ao5rkjaiutlz6exox (/home/gump/.gradle/caches/2.14.1/scripts-remapped/gump_init_script_12yx9mtnnuqfgx94h66zzd6bx/8q5vv4u2ao5rkjaiutlz6exox/init57408229)
as it was not closed cleanly.
00:20:01.654 [DEBUG] [org.gradle.cache.internal.DefaultFileLockManager] Releasing lock on
init remapped class cache for 8q5vv4u2ao5rkjaiutlz6exox (/home/gump/.gradle/caches/2.14.1/scripts-remapped/gump_init_script_12yx9mtnnuqfgx94h66zzd6bx/8q5vv4u2ao5rkjaiutlz6exox/init57408229).
00:20:01.657 [DEBUG] [org.gradle.cache.internal.DefaultFileLockManager] Waiting to acquire
exclusive lock on init remapped class cache for 8q5vv4u2ao5rkjaiutlz6exox (/home/gump/.gradle/caches/2.14.1/scripts-remapped/gump_init_script_12yx9mtnnuqfgx94h66zzd6bx/8q5vv4u2ao5rkjaiutlz6exox/init57408229).
00:20:01.658 [DEBUG] [org.gradle.cache.internal.DefaultFileLockManager] Lock acquired.
00:20:01.659 [DEBUG] [org.gradle.cache.internal.DefaultPersistentDirectoryCache] Invalidating
init remapped class cache for 8q5vv4u2ao5rkjaiutlz6exox (/home/gump/.gradle/caches/2.14.1/scripts-remapped/gump_init_script_12yx9mtnnuqfgx94h66zzd6bx/8q5vv4u2ao5rkjaiutlz6exox/init57408229)
as it was not closed cleanly.
00:20:01.662 [DEBUG] [org.gradle.cache.internal.DefaultFileLockManager] Waiting to acquire
shared lock on init generic class cache for initialization script '/srv/gump/public/workspace/java-hamcrest/gump_init_script.gradle'
(/home/gump/.gradle/caches/2.14.1/scripts/8q5vv4u2ao5rkjaiutlz6exox/init/init57408229).
00:20:01.663 [DEBUG] [org.gradle.cache.internal.DefaultFileLockManager] Lock acquired.
00:20:01.664 [DEBUG] [org.gradle.cache.internal.DefaultPersistentDirectoryCache] Invalidating
init generic class cache for initialization script '/srv/gump/public/workspace/java-hamcrest/gump_init_script.gradle'
(/home/gump/.gradle/caches/2.14.1/scripts/8q5vv4u2ao5rkjaiutlz6exox/init/init57408229) as
it was not closed cleanly.
00:20:01.664 [DEBUG] [org.gradle.cache.internal.DefaultFileLockManager] Releasing lock on
init generic class cache for initialization script '/srv/gump/public/workspace/java-hamcrest/gump_init_script.gradle'
(/home/gump/.gradle/caches/2.14.1/scripts/8q5vv4u2ao5rkjaiutlz6exox/init/init57408229).
00:20:01.664 [DEBUG] [org.gradle.cache.internal.DefaultFileLockManager] Waiting to acquire
exclusive lock on init generic class cache for initialization script '/srv/gump/public/workspace/java-hamcrest/gump_init_script.gradle'
(/home/gump/.gradle/caches/2.14.1/scripts/8q5vv4u2ao5rkjaiutlz6exox/init/init57408229).
00:20:01.665 [DEBUG] [org.gradle.cache.internal.DefaultFileLockManager] Lock acquired.
00:20:01.665 [DEBUG] [org.gradle.cache.internal.DefaultPersistentDirectoryCache] Invalidating
init generic class cache for initialization script '/srv/gump/public/workspace/java-hamcrest/gump_init_script.gradle'
(/home/gump/.gradle/caches/2.14.1/scripts/8q5vv4u2ao5rkjaiutlz6exox/init/init57408229) as
it was not closed cleanly.
00:20:01.665 [INFO] [org.gradle.groovy.scripts.internal.DefaultScriptCompilationHandler] Compiling
initialization script '/srv/gump/public/workspace/java-hamcrest/gump_init_script.gradle' using
BuildScriptTransformer.
00:20:02.064 [DEBUG] [org.gradle.groovy.scripts.internal.DefaultScriptCompilationHandler]
Timing: Writing script to cache at /home/gump/.gradle/caches/2.14.1/scripts/8q5vv4u2ao5rkjaiutlz6exox/init/init57408229/classes
took: 0.399 secs
00:20:02.065 [DEBUG] [org.gradle.cache.internal.DefaultFileLockManager] Releasing lock on
init generic class cache for initialization script '/srv/gump/public/workspace/java-hamcrest/gump_init_script.gradle'
(/home/gump/.gradle/caches/2.14.1/scripts/8q5vv4u2ao5rkjaiutlz6exox/init/init57408229).
00:20:02.065 [DEBUG] [org.gradle.cache.internal.DefaultFileLockManager] Waiting to acquire
shared lock on init generic class cache for initialization script '/srv/gump/public/workspace/java-hamcrest/gump_init_script.gradle'
(/home/gump/.gradle/caches/2.14.1/scripts/8q5vv4u2ao5rkjaiutlz6exox/init/init57408229).
00:20:02.065 [DEBUG] [org.gradle.cache.internal.DefaultFileLockManager] Lock acquired.
00:20:02.066 [DEBUG] [org.gradle.cache.internal.DefaultFileLockManager] Releasing lock on
init generic class cache for initialization script '/srv/gump/public/workspace/java-hamcrest/gump_init_script.gradle'
(/home/gump/.gradle/caches/2.14.1/scripts/8q5vv4u2ao5rkjaiutlz6exox/init/init57408229).
00:20:02.086 [DEBUG] [org.gradle.cache.internal.DefaultFileLockManager] Releasing lock on
init remapped class cache for 8q5vv4u2ao5rkjaiutlz6exox (/home/gump/.gradle/caches/2.14.1/scripts-remapped/gump_init_script_12yx9mtnnuqfgx94h66zzd6bx/8q5vv4u2ao5rkjaiutlz6exox/init57408229).
00:20:02.087 [DEBUG] [org.gradle.cache.internal.DefaultFileLockManager] Waiting to acquire
shared lock on init remapped class cache for 8q5vv4u2ao5rkjaiutlz6exox (/home/gump/.gradle/caches/2.14.1/scripts-remapped/gump_init_script_12yx9mtnnuqfgx94h66zzd6bx/8q5vv4u2ao5rkjaiutlz6exox/init57408229).
00:20:02.087 [DEBUG] [org.gradle.cache.internal.DefaultFileLockManager] Lock acquired.
00:20:02.087 [DEBUG] [org.gradle.cache.internal.DefaultFileLockManager] Releasing lock on
init remapped class cache for 8q5vv4u2ao5rkjaiutlz6exox (/home/gump/.gradle/caches/2.14.1/scripts-remapped/gump_init_script_12yx9mtnnuqfgx94h66zzd6bx/8q5vv4u2ao5rkjaiutlz6exox/init57408229).
00:20:02.353 [DEBUG] [org.gradle.initialization.buildsrc.BuildSourceBuilder] Starting to build
the build sources.
00:20:02.353 [DEBUG] [org.gradle.initialization.buildsrc.BuildSourceBuilder] Gradle source
dir does not exist. We leave.
00:20:02.354 [DEBUG] [org.gradle.initialization.DefaultGradlePropertiesLoader] Found env project
properties: []
00:20:02.354 [DEBUG] [org.gradle.initialization.DefaultGradlePropertiesLoader] Found system
project properties: []
00:20:02.373 [DEBUG] [org.gradle.cache.internal.DefaultFileLockManager] Waiting to acquire
shared lock on cp_settings remapped class cache for 64g8nj5ap81xt4wz300ry8jej (/home/gump/.gradle/caches/2.14.1/scripts-remapped/settings_3zs6mr5f4qq49n5mpvcvec71o/64g8nj5ap81xt4wz300ry8jej/cp_settings57408229).
00:20:02.375 [DEBUG] [org.gradle.cache.internal.DefaultFileLockManager] Lock acquired.
00:20:02.377 [DEBUG] [org.gradle.cache.internal.DefaultFileLockManager] Releasing lock on
cp_settings remapped class cache for 64g8nj5ap81xt4wz300ry8jej (/home/gump/.gradle/caches/2.14.1/scripts-remapped/settings_3zs6mr5f4qq49n5mpvcvec71o/64g8nj5ap81xt4wz300ry8jej/cp_settings57408229).
00:20:02.380 [DEBUG] [org.gradle.cache.internal.DefaultFileLockManager] Waiting to acquire
shared lock on settings remapped class cache for 64g8nj5ap81xt4wz300ry8jej (/home/gump/.gradle/caches/2.14.1/scripts-remapped/settings_3zs6mr5f4qq49n5mpvcvec71o/64g8nj5ap81xt4wz300ry8jej/settings57408229).
00:20:02.381 [DEBUG] [org.gradle.cache.internal.DefaultFileLockManager] Lock acquired.
00:20:02.386 [DEBUG] [org.gradle.cache.internal.DefaultFileLockManager] Releasing lock on
settings remapped class cache for 64g8nj5ap81xt4wz300ry8jej (/home/gump/.gradle/caches/2.14.1/scripts-remapped/settings_3zs6mr5f4qq49n5mpvcvec71o/64g8nj5ap81xt4wz300ry8jej/settings57408229).
00:20:02.422 [ERROR] [org.gradle.BuildExceptionReporter] 
00:20:02.422 [ERROR] [org.gradle.BuildExceptionReporter] FAILURE: Build failed with an exception.
00:20:02.422 [ERROR] [org.gradle.BuildExceptionReporter] 
00:20:02.422 [ERROR] [org.gradle.BuildExceptionReporter] * Where:
00:20:02.423 [ERROR] [org.gradle.BuildExceptionReporter] Settings file '/srv/gump/public/workspace/java-hamcrest/settings.gradle'
line: 1
00:20:02.423 [ERROR] [org.gradle.BuildExceptionReporter] 
00:20:02.423 [ERROR] [org.gradle.BuildExceptionReporter] * What went wrong:
00:20:02.423 [ERROR] [org.gradle.BuildExceptionReporter] A problem occurred evaluating settings
'java-hamcrest'.
00:20:02.423 [ERROR] [org.gradle.BuildExceptionReporter] > Could not find method enableFeaturePreview()
for arguments [STABLE_PUBLISHING] on settings 'java-hamcrest' of type org.gradle.initialization.DefaultSettings.
00:20:02.423 [ERROR] [org.gradle.BuildExceptionReporter] 
00:20:02.424 [ERROR] [org.gradle.BuildExceptionReporter] * Try:
00:20:02.424 [ERROR] [org.gradle.BuildExceptionReporter] Run with --stacktrace option to get
the stack trace. 
00:20:02.424 [LIFECYCLE] [org.gradle.BuildResultLogger] 
00:20:02.425 [LIFECYCLE] [org.gradle.BuildResultLogger] BUILD FAILED
00:20:02.425 [LIFECYCLE] [org.gradle.BuildResultLogger] 
00:20:02.425 [LIFECYCLE] [org.gradle.BuildResultLogger] Total time: 3.937 secs
00:20:02.426 [DEBUG] [org.gradle.cache.internal.DefaultCacheAccess] Cache Plugin Resolution
Cache (/home/gump/.gradle/caches/2.14.1/plugin-resolution) was closed 0 times.
---------------------------------------------

To subscribe to this information via syndicated feeds:
- RSS: http://vmgump-vm3.apache.org/java-hamcrest/java-hamcrest/rss.xml
- Atom: http://vmgump-vm3.apache.org/java-hamcrest/java-hamcrest/atom.xml

============================== Gump Tracking Only ===
Produced by Apache Gump(TM) version 2.3.
Gump Run 20190522000006, vmgump-vm3.apache.org:vmgump:20190522000006
Gump E-mail Identifier (unique within run) #1.

*********************************************************** G U M P
[GUMP@vmgump-vm3]: Project fontbox (in module pdfbox) failed
To whom it may engage...
        
This is an automated request, but not an unsolicited one. For 
more information please visit http://gump.apache.org/nagged.html, 
and/or contact the folk at general@gump.apache.org.

Project fontbox has an issue affecting its community integration.
This issue affects 1 projects,
 and has been outstanding for 331 runs.
The current state of this project is 'Failed', with reason 'Build Failed'.
For reference only, the following projects are affected by this:
    - fontbox :  Apache PDFBox is an open source Java PDF library for working...


Full details are available at:
    http://vmgump-vm3.apache.org/pdfbox/fontbox/index.html

That said, some information snippets are provided here.

The following annotations (debug/informational/warning/error messages) were provided:
 -DEBUG- Sole jar output [fontbox-*[0-9T].jar] identifier set to project name
 -DEBUG- (Apache Gump generated) Apache Maven Settings in: /srv/gump/public/workspace/pdfbox/fontbox/gump_mvn_settings.xml
 -INFO- Failed with reason build failed
 -DEBUG- Maven POM in: /srv/gump/public/workspace/pdfbox/fontbox/pom.xml
 -INFO- Failed to extract fallback artifacts from Gump Repository



The following work was performed:
http://vmgump-vm3.apache.org/pdfbox/fontbox/gump_work/build_pdfbox_fontbox.html
Work Name: build_pdfbox_fontbox (Type: Build)
Work ended in a state of : Failed
Elapsed: 4 secs
Command Line: /opt/maven3/bin/mvn --batch-mode --settings /srv/gump/public/workspace/pdfbox/fontbox/gump_mvn_settings.xml
package 
[Working Directory: /srv/gump/public/workspace/pdfbox/fontbox]
M2_HOME: /opt/maven3
---------------------------------------------
[INFO] Scanning for projects...
[INFO]                                                                         
[INFO] ------------------------------------------------------------------------
[INFO] Building Apache FontBox 3.0.0-SNAPSHOT
[INFO] ------------------------------------------------------------------------
[INFO] Downloading: http://localhost:8192/maven2/commons-logging/commons-logging/1.2/commons-logging-1.2.jar
[INFO] Downloaded: http://localhost:8192/maven2/commons-logging/commons-logging/1.2/commons-logging-1.2.jar
(56 KB at 750.2 KB/sec)
[INFO] 
[INFO] --- maven-enforcer-plugin:1.4.1:enforce (default) @ fontbox ---
[WARNING] Rule 0: org.apache.maven.plugins.enforcer.RequireMavenVersion failed with message:
Detected Maven Version: 3.3.9 is not in the allowed range 3.5.
[INFO] ------------------------------------------------------------------------
[INFO] BUILD FAILURE
[INFO] ------------------------------------------------------------------------
[INFO] Total time: 2.730 s
[INFO] Finished at: 2019-05-22T00:48:16+00:00
[INFO] Final Memory: 16M/176M
[INFO] ------------------------------------------------------------------------
[ERROR] Failed to execute goal org.apache.maven.plugins:maven-enforcer-plugin:1.4.1:enforce
(default) on project fontbox: Some Enforcer rules have failed. Look above for specific messages
explaining why the rule failed. -> [Help 1]
[ERROR] 
[ERROR] To see the full stack trace of the errors, re-run Maven with the -e switch.
[ERROR] Re-run Maven using the -X switch to enable full debug logging.
[ERROR] 
[ERROR] For more information about the errors and possible solutions, please read the following
articles:
[ERROR] [Help 1] http://cwiki.apache.org/confluence/display/MAVEN/MojoExecutionException
---------------------------------------------

To subscribe to this information via syndicated feeds:
- RSS: http://vmgump-vm3.apache.org/pdfbox/fontbox/rss.xml
- Atom: http://vmgump-vm3.apache.org/pdfbox/fontbox/atom.xml

============================== Gump Tracking Only ===
Produced by Apache Gump(TM) version 2.3.
Gump Run 20190522000006, vmgump-vm3.apache.org:vmgump:20190522000006
Gump E-mail Identifier (unique within run) #2.

*********************************************************** G U M P
[GUMP@vmgump-vm3]: Project test-ant (in module ant) failed
To whom it may engage...
        
This is an automated request, but not an unsolicited one. For 
more information please visit http://gump.apache.org/nagged.html, 
and/or contact the folk at general@gump.apache.org.

Project test-ant has an issue affecting its community integration.
This issue affects 1 projects,
 and has been outstanding for 33 runs.
The current state of this project is 'Failed', with reason 'Build Failed'.
For reference only, the following projects are affected by this:
    - test-ant :  Java based build tool


Full details are available at:
    http://vmgump-vm3.apache.org/ant/test-ant/index.html

That said, some information snippets are provided here.

The following annotations (debug/informational/warning/error messages) were provided:
 -WARNING- Bad *Optional* Dependency. Project: bsh : unknown to *this* workspace
 -INFO- Failed with reason build failed



The following work was performed:
http://vmgump-vm3.apache.org/ant/test-ant/gump_work/build_ant_test-ant.html
Work Name: build_ant_test-ant (Type: Build)
Work ended in a state of : Failed
Elapsed: 9 mins 28 secs
Command Line: /usr/lib/jvm/java-8-oracle/bin/java -Djava.awt.headless=true -Dbuild.sysclasspath=only
-Dsun.zip.disableMemoryMapping=true -Xbootclasspath/p:/srv/gump/public/workspace/xml-xerces2/build/xercesImpl.jar:/srv/gump/public/workspace/xml-commons/java/external/build/xml-apis.jar:/srv/gump/public/workspace/xml-xalan/build/xalan-unbundled.jar:/srv/gump/public/workspace/xml-xalan/build/serializer.jar
org.apache.tools.ant.Main -Dgump.merge=/srv/gump/public/gump/work/merge.xml -Dtest.haltonfailure=false
-Dant.home=/srv/gump/public/workspace/ant/dist run-tests 
[Working Directory: /srv/gump/public/workspace/ant]
CLASSPATH: /usr/lib/jvm/java-8-oracle/lib/tools.jar:/srv/gump/public/workspace/ant/build/testcases:/srv/gump/public/workspace/ant/src/tests/junit:/srv/gump/public/workspace/ant/src/etc/testcases:/srv/gump/public/workspace/ant/src/etc/testcases/taskdefs/optional/out:/srv/gump/public/workspace/ant/src/tests/antunit/filters:/srv/gump/public/workspace/ant/src/tests/antunit/taskdefs/importtests:/srv/gump/public/workspace/ant/src/tests/antunit/filters/foo:/srv/gump/public/workspace/ant/src/tests/antunit/taskdefs/foo:/srv/gump/public/workspace/ant/build/antunit/tmp/testinput/build:/srv/gump/public/workspace/ant/build/antunit/tmp/testoutput:/srv/gump/public/workspace/ant/build/antunit/tmp/test.jar:/srv/gump/public/workspace/ant/build/antunit/tmp/test1.jar:/srv/gump/public/workspace/ant/build/antunit/tmp/test2.jar:/srv/gump/public/workspace/ant/build/antunit/tmp/test3.jar:/srv/gump/public/workspace/ant/build/antunit/tmp/test4.jar:/srv/gump/public/workspace/ant/build/antunit/tmp/test5.jar:/srv
 /gump/public/workspace/ant/build/antunit/tmp/resources:/srv/gump/public/workspace/ant/build/lib/ant.jar:/srv/gump/public/workspace/ant/build/lib/ant-launcher.jar:/srv/gump/public/workspace/ant/build/lib/ant-antlr.jar:/srv/gump/public/workspace/ant/build/lib/ant-apache-bcel.jar:/srv/gump/public/workspace/ant/build/lib/ant-apache-bsf.jar:/srv/gump/public/workspace/ant/build/lib/ant-apache-log4j.jar:/srv/gump/public/workspace/ant/build/lib/ant-apache-oro.jar:/srv/gump/public/workspace/ant/build/lib/ant-apache-regexp.jar:/srv/gump/public/workspace/ant/build/lib/ant-apache-resolver.jar:/srv/gump/public/workspace/ant/build/lib/ant-apache-xalan2.jar:/srv/gump/public/workspace/ant/build/lib/ant-commons-logging.jar:/srv/gump/public/workspace/ant/build/lib/ant-commons-net.jar:/srv/gump/public/workspace/ant/build/lib/ant-jai.jar:/srv/gump/public/workspace/ant/build/lib/ant-javamail.jar:/srv/gump/public/workspace/ant/build/lib/ant-jdepend.jar:/srv/gump/public/workspace/ant/build/lib/ant-jmf.jar
 :/srv/gump/public/workspace/ant/build/lib/ant-jsch.jar:/srv/gump/public/workspace/ant/build/lib/ant-junit.jar:/srv/gump/public/workspace/ant/build/lib/ant-junit4.jar:/srv/gump/public/workspace/ant/build/lib/ant-swing.jar:/srv/gump/public/workspace/ant/build/lib/ant-xz.jar:/srv/gump/packages/antlr/antlr-3.1.3.jar:/srv/gump/public/workspace/ant-contrib/lib/bcel/jars/bcel-5.1.jar:/srv/gump/public/workspace/apache-commons/logging/target/commons-logging-20190522.jar:/srv/gump/public/workspace/apache-commons/logging/target/commons-logging-api-20190522.jar:/srv/gump/public/workspace/apache-commons/net/target/commons-net-3.7-SNAPSHOT.jar:/srv/gump/public/workspace/apache-commons/net/target/commons-net-ftp-3.7-SNAPSHOT.jar:/srv/gump/packages/jaf-1.1ea/activation.jar:/srv/gump/public/workspace/jakarta-bsf/build/lib/bsf.jar:/srv/gump/packages/apache-attic/jakarta-regexp-1.5.jar:/srv/gump/public/workspace/jakarta-servletapi-5/jsr154/dist/lib/servlet-api.jar:/srv/gump/packages/javamail-1.4/mail.
 jar:/srv/gump/packages/javamail-1.4/lib/mailapi.jar:/srv/gump/packages/jdepend-2.6/lib/jdepend.jar:/srv/gump/packages/jsch/jsch-0.1.45.jar:/srv/gump/public/workspace/logging-log4j-12/target/log4j-1.2.18-SNAPSHOT.jar:/srv/gump/packages/apache-attic/oro-2.0.8.jar:/srv/gump/public/workspace/xz-java/build/jar-20190522/xz.jar:/srv/gump/public/workspace/antlibs-antunit/build/ant-antunit-20190522.jar:/srv/gump/packages/hamcrest/hamcrest-core-1.3.jar:/srv/gump/public/workspace/junit/target/junit-4.13-SNAPSHOT.jar:/srv/gump/public/workspace/xml-commons/java/external/build/xml-apis-ext.jar:/srv/gump/packages/hamcrest/hamcrest-library-1.3.jar:/srv/gump/public/workspace/commons-codec-1.x/dist/commons-codec-20190522.jar
---------------------------------------------
[au:antunit] Build File: /srv/gump/public/workspace/ant/src/tests/antunit/types/selectors/modified-test.xml
[au:antunit] Tests run: 1, Failures: 0, Errors: 0, Time elapsed: 0.01 sec
[au:antunit] Target: testUpdate took 0.008 sec
[au:antunit] Build File: /srv/gump/public/workspace/ant/src/tests/antunit/types/selectors/ownedby-test.xml
[au:antunit] Tests run: 3, Failures: 0, Errors: 0, Time elapsed: 0.07 sec
[au:antunit] Target: testOwnedBy took 0.003 sec
[au:antunit] Target: testAsTrueConditions took 0 sec
[au:antunit] Target: testRequiresOwner took 0.002 sec
[au:antunit] Build File: /srv/gump/public/workspace/ant/src/tests/antunit/types/selectors/present-test.xml
[au:antunit] Tests run: 1, Failures: 0, Errors: 0, Time elapsed: 0.002 sec
[au:antunit] Target: testMapperByTypedef took 0.001 sec
[au:antunit] Build File: /srv/gump/public/workspace/ant/src/tests/antunit/types/selectors/readwrite-test.xml
[au:antunit] Tests run: 4, Failures: 0, Errors: 0, Time elapsed: 0.013 sec
[au:antunit] Target: testWritable took 0.002 sec
[au:antunit] Target: testAsConditions took 0.001 sec
[au:antunit] Target: testReadable took 0.002 sec
[au:antunit] Target: testUnwritable took 0.001 sec
[au:antunit] Build File: /srv/gump/public/workspace/ant/src/tests/antunit/types/selectors/select-test.xml
[au:antunit] Tests run: 4, Failures: 0, Errors: 0, Time elapsed: 0.022 sec
[au:antunit] Target: testIfFalse took 0.007 sec
[au:antunit] Target: testIfNotSet took 0.001 sec
[au:antunit] Target: testIfTrue took 0.001 sec
[au:antunit] Target: testIfSet took 0.001 sec
[au:antunit] Build File: /srv/gump/public/workspace/ant/src/tests/antunit/types/selectors/symlink-test.xml
[au:antunit] Tests run: 4, Failures: 0, Errors: 0, Time elapsed: 0.018 sec
[au:antunit] Target: testAsFalseConditions took 0.001 sec
[au:antunit] Target: testAsTrueConditions took 0.002 sec
[au:antunit] Target: testNoSymlink took 0.001 sec
[au:antunit] Target: testSymlink took 0 sec
[au:antunit] Build File: /srv/gump/public/workspace/ant/src/tests/antunit/types/tarfileset-test.xml
[au:antunit] Tests run: 3, Failures: 0, Errors: 0, Time elapsed: 0.008 sec
[au:antunit] Target: test-refid-check-encoding took 0 sec
[au:antunit] Target: testMissingArchive took 0 sec
[au:antunit] Target: testMissingArchiveDoesntMatter took 0.001 sec
[au:antunit] Build File: /srv/gump/public/workspace/ant/src/tests/antunit/types/zipfileset-test.xml
[au:antunit] Tests run: 5, Failures: 0, Errors: 0, Time elapsed: 0.024 sec
[au:antunit] Target: testMissingArchive took 0.001 sec
[au:antunit] Target: test-refid-check-encoding took 0 sec
[au:antunit] Target: test-refid-modify took 0.012 sec
[au:antunit] Target: test-refid-check-prefix took 0 sec
[au:antunit] Target: testMissingArchiveDoesntMatter took 0 sec

check-failed:

run-tests:

BUILD FAILED
/srv/gump/public/workspace/ant/build.xml:1670: Unit tests failed

Total time: 9 minutes 28 seconds
---------------------------------------------

To subscribe to this information via syndicated feeds:
- RSS: http://vmgump-vm3.apache.org/ant/test-ant/rss.xml
- Atom: http://vmgump-vm3.apache.org/ant/test-ant/atom.xml

============================== Gump Tracking Only ===
Produced by Apache Gump(TM) version 2.3.
Gump Run 20190522000006, vmgump-vm3.apache.org:vmgump:20190522000006
Gump E-mail Identifier (unique within run) #4.

*********************************************************** G U M P
[GUMP@vmgump-vm3]: Project objenesis (in module objenesis) failed
To whom it may engage...
        
This is an automated request, but not an unsolicited one. For 
more information please visit http://gump.apache.org/nagged.html, 
and/or contact the folk at general@gump.apache.org.

Project objenesis has an issue affecting its community integration.
This issue affects 10 projects,
 and has been outstanding for 331 runs.
The current state of this project is 'Failed', with reason 'Build Failed'.
For reference only, the following projects are affected by this:
    - objenesis :  Objenesis is a small Java library that serves one purpose: T...
    - tomcat-tc7.0.x-test-apr :  Tomcat 7.x, a web server implementing Java Servlet 3.0,
    ...
    - tomcat-tc7.0.x-test-bio :  Tomcat 7.x, a web server implementing Java Servlet 3.0,
    ...
    - tomcat-tc7.0.x-test-nio :  Tomcat 7.x, a web server implementing Java Servlet 3.0,
    ...
    - tomcat-tc8.5.x-test-apr :  Tomcat 8.x, a web server implementing the Java Servlet 3.1,
...
    - tomcat-tc8.5.x-test-nio :  Tomcat 8.x, a web server implementing the Java Servlet 3.1,
...
    - tomcat-tc8.5.x-test-nio2 :  Tomcat 8.x, a web server implementing the Java Servlet 3.1,
...
    - tomcat-trunk-test-apr :  Tomcat 9.x, a web server implementing the Java Servlet 4.0,
...
    - tomcat-trunk-test-nio :  Tomcat 9.x, a web server implementing the Java Servlet 4.0,
...
    - tomcat-trunk-test-nio2 :  Tomcat 9.x, a web server implementing the Java Servlet 4.0,
...


Full details are available at:
    http://vmgump-vm3.apache.org/objenesis/objenesis/index.html

That said, some information snippets are provided here.

The following annotations (debug/informational/warning/error messages) were provided:
 -DEBUG- (Apache Gump generated) Apache Maven Settings in: /srv/gump/public/workspace/objenesis/main/gump_mvn_settings.xml
 -INFO- Failed with reason build failed
 -DEBUG- Maven POM in: /srv/gump/public/workspace/objenesis/main/pom.xml
 -INFO- Failed to extract fallback artifacts from Gump Repository



The following work was performed:
http://vmgump-vm3.apache.org/objenesis/objenesis/gump_work/build_objenesis_objenesis.html
Work Name: build_objenesis_objenesis (Type: Build)
Work ended in a state of : Failed
Elapsed: 5 secs
Command Line: /opt/maven3/bin/mvn --batch-mode -DskipTests=true -Dmaven.javadoc.failOnError=false
--settings /srv/gump/public/workspace/objenesis/main/gump_mvn_settings.xml package 
[Working Directory: /srv/gump/public/workspace/objenesis/main]
M2_HOME: /opt/maven3
---------------------------------------------
[INFO] Scanning for projects...
[INFO]                                                                         
[INFO] ------------------------------------------------------------------------
[INFO] Building Objenesis 3.1-SNAPSHOT
[INFO] ------------------------------------------------------------------------
[INFO] 
[INFO] --- maven-timestamp-plugin:1.0:create (year) @ objenesis ---
[INFO] Downloading: http://localhost:8192/maven2/org/apache/maven/maven-plugin-api/2.0.2/maven-plugin-api-2.0.2.pom
[INFO] Downloaded: http://localhost:8192/maven2/org/apache/maven/maven-plugin-api/2.0.2/maven-plugin-api-2.0.2.pom
(643 B at 6.5 KB/sec)
[INFO] Downloading: http://localhost:8192/maven2/org/apache/maven/maven-project/2.0.2/maven-project-2.0.2.pom
[INFO] Downloaded: http://localhost:8192/maven2/org/apache/maven/maven-project/2.0.2/maven-project-2.0.2.pom
(2 KB at 109.9 KB/sec)
[INFO] Downloading: http://localhost:8192/maven2/org/apache/maven/maven-profile/2.0.2/maven-profile-2.0.2.pom
[INFO] Downloaded: http://localhost:8192/maven2/org/apache/maven/maven-profile/2.0.2/maven-profile-2.0.2.pom
(2 KB at 71.0 KB/sec)
[INFO] Downloading: http://localhost:8192/maven2/org/apache/maven/maven-model/2.0.2/maven-model-2.0.2.pom
[INFO] Downloaded: http://localhost:8192/maven2/org/apache/maven/maven-model/2.0.2/maven-model-2.0.2.pom
(3 KB at 176.5 KB/sec)
[INFO] Downloading: http://localhost:8192/maven2/org/apache/maven/maven-settings/2.0.2/maven-settings-2.0.2.pom
[INFO] Downloaded: http://localhost:8192/maven2/org/apache/maven/maven-settings/2.0.2/maven-settings-2.0.2.pom
(2 KB at 74.4 KB/sec)
[INFO] Downloading: http://localhost:8192/maven2/org/apache/maven/maven-plugin-api/2.0.2/maven-plugin-api-2.0.2.jar
[INFO] Downloading: http://localhost:8192/maven2/org/apache/maven/maven-profile/2.0.2/maven-profile-2.0.2.jar
[INFO] Downloading: http://localhost:8192/maven2/org/apache/maven/maven-model/2.0.2/maven-model-2.0.2.jar
[INFO] Downloading: http://localhost:8192/maven2/org/apache/maven/maven-repository-metadata/2.0.2/maven-repository-metadata-2.0.2.jar
[INFO] Downloading: http://localhost:8192/maven2/org/apache/maven/maven-project/2.0.2/maven-project-2.0.2.jar
[INFO] Downloading: http://localhost:8192/maven2/org/codehaus/plexus/plexus-utils/1.1/plexus-utils-1.1.jar
[INFO] Downloaded: http://localhost:8192/maven2/org/apache/maven/maven-profile/2.0.2/maven-profile-2.0.2.jar
(30 KB at 738.8 KB/sec)
[INFO] Downloading: http://localhost:8192/maven2/org/apache/maven/maven-artifact/2.0.2/maven-artifact-2.0.2.jar
[INFO] Downloaded: http://localhost:8192/maven2/org/apache/maven/maven-project/2.0.2/maven-project-2.0.2.jar
(105 KB at 1582.8 KB/sec)
[INFO] Downloading: http://localhost:8192/maven2/org/apache/maven/maven-settings/2.0.2/maven-settings-2.0.2.jar
[INFO] Downloaded: http://localhost:8192/maven2/org/codehaus/plexus/plexus-utils/1.1/plexus-utils-1.1.jar
(165 KB at 2572.1 KB/sec)
[INFO] Downloaded: http://localhost:8192/maven2/org/apache/maven/maven-repository-metadata/2.0.2/maven-repository-metadata-2.0.2.jar
(20 KB at 270.9 KB/sec)
[INFO] Downloaded: http://localhost:8192/maven2/org/apache/maven/maven-plugin-api/2.0.2/maven-plugin-api-2.0.2.jar
(9 KB at 110.0 KB/sec)
[INFO] Downloaded: http://localhost:8192/maven2/org/apache/maven/maven-artifact/2.0.2/maven-artifact-2.0.2.jar
(77 KB at 1035.8 KB/sec)
[INFO] Downloaded: http://localhost:8192/maven2/org/apache/maven/maven-settings/2.0.2/maven-settings-2.0.2.jar
(43 KB at 497.4 KB/sec)
[INFO] ------------------------------------------------------------------------
[INFO] BUILD FAILURE
[INFO] ------------------------------------------------------------------------
[INFO] Total time: 3.497 s
[INFO] Finished at: 2019-05-22T01:03:45+00:00
[INFO] Final Memory: 14M/151M
[INFO] ------------------------------------------------------------------------
[ERROR] Failed to execute goal com.keyboardsamurais.maven:maven-timestamp-plugin:1.0:create
(year) on project objenesis: Execution year of goal com.keyboardsamurais.maven:maven-timestamp-plugin:1.0:create
failed: Plugin com.keyboardsamurais.maven:maven-timestamp-plugin:1.0 or one of its dependencies
could not be resolved: Could not transfer artifact org.apache.maven:maven-model:jar:2.0.2
from/to gump-central (http://localhost:8192/maven2): TransferFailedException: ClientProtocolException:
Status line contains invalid status code: HTTP/1.1 :01 :01 -> [Help 1]
[ERROR] 
[ERROR] To see the full stack trace of the errors, re-run Maven with the -e switch.
[ERROR] Re-run Maven using the -X switch to enable full debug logging.
[ERROR] 
[ERROR] For more information about the errors and possible solutions, please read the following
articles:
[ERROR] [Help 1] http://cwiki.apache.org/confluence/display/MAVEN/PluginResolutionException
---------------------------------------------

To subscribe to this information via syndicated feeds:
- RSS: http://vmgump-vm3.apache.org/objenesis/objenesis/rss.xml
- Atom: http://vmgump-vm3.apache.org/objenesis/objenesis/atom.xml

============================== Gump Tracking Only ===
Produced by Apache Gump(TM) version 2.3.
Gump Run 20190522000006, vmgump-vm3.apache.org:vmgump:20190522000006
Gump E-mail Identifier (unique within run) #5.

*********************************************************** G U M P
[GUMP@vmgump-vm3]: Project commons-beanutils2 (in module apache-commons) failed
To whom it may engage...
        
This is an automated request, but not an unsolicited one. For 
more information please visit http://gump.apache.org/nagged.html, 
and/or contact the folk at general@gump.apache.org.

Project commons-beanutils2 has an issue affecting its community integration.
This issue affects 1 projects,
 and has been outstanding for 33 runs.
The current state of this project is 'Failed', with reason 'Build Failed'.
For reference only, the following projects are affected by this:
    - commons-beanutils2 :  Bean Utilities


Full details are available at:
    http://vmgump-vm3.apache.org/apache-commons/commons-beanutils2/index.html

That said, some information snippets are provided here.

The following annotations (debug/informational/warning/error messages) were provided:
 -DEBUG- Sole pom output [pom.xml] identifier set to project name
 -DEBUG- Dependency on junit exists, no need to add for property junit.home.
 -INFO- Failed with reason build failed
 -INFO- Failed to extract fallback artifacts from Gump Repository



The following work was performed:
http://vmgump-vm3.apache.org/apache-commons/commons-beanutils2/gump_work/build_apache-commons_commons-beanutils2.html
Work Name: build_apache-commons_commons-beanutils2 (Type: Build)
Work ended in a state of : Failed
Elapsed: 
Command Line: /usr/lib/jvm/java-8-oracle/bin/java -Djava.awt.headless=true -Dbuild.sysclasspath=only
-Dsun.zip.disableMemoryMapping=true -Xbootclasspath/p:/srv/gump/public/workspace/xml-xerces2/build/xercesImpl.jar:/srv/gump/public/workspace/xml-commons/java/external/build/xml-apis.jar
org.apache.tools.ant.Main -Dgump.merge=/srv/gump/public/gump/work/merge.xml -Djunit.home=/srv/gump/public/workspace/junit
-Dcomponent.version=20190522 jar 
[Working Directory: /srv/gump/public/workspace/apache-commons/beanutils]
CLASSPATH: /usr/lib/jvm/java-8-oracle/lib/tools.jar:/srv/gump/public/workspace/apache-commons/beanutils/target/classes:/srv/gump/public/workspace/ant/dist/lib/ant.jar:/srv/gump/public/workspace/ant/dist/lib/ant-launcher.jar:/srv/gump/public/workspace/ant/dist/lib/ant-jmf.jar:/srv/gump/public/workspace/ant/dist/lib/ant-junit.jar:/srv/gump/public/workspace/ant/dist/lib/ant-junit4.jar:/srv/gump/public/workspace/ant/dist/lib/ant-swing.jar:/srv/gump/public/workspace/ant/dist/lib/ant-apache-resolver.jar:/srv/gump/public/workspace/ant/dist/lib/ant-apache-xalan2.jar:/srv/gump/public/workspace/xml-commons/java/build/resolver.jar:/srv/gump/public/workspace/xml-commons/java/external/build/xml-apis-ext.jar:/srv/gump/public/workspace/apache-commons/logging/target/commons-logging-20190522.jar:/srv/gump/public/workspace/apache-commons/logging/target/commons-logging-api-20190522.jar:/srv/gump/public/workspace/commons-collections/target/commons-collections4-4.4-SNAPSHOT.jar:/srv/gump/public/workspace
 /junit/target/junit-4.13-SNAPSHOT.jar
---------------------------------------------
Buildfile: build.xml does not exist!
Build failed
---------------------------------------------

To subscribe to this information via syndicated feeds:
- RSS: http://vmgump-vm3.apache.org/apache-commons/commons-beanutils2/rss.xml
- Atom: http://vmgump-vm3.apache.org/apache-commons/commons-beanutils2/atom.xml

============================== Gump Tracking Only ===
Produced by Apache Gump(TM) version 2.3.
Gump Run 20190522000006, vmgump-vm3.apache.org:vmgump:20190522000006
Gump E-mail Identifier (unique within run) #6.


--
Apache Gump
http://gump.apache.org/ [Instance: vmgump-vm3]

---------------------------------------------------------------------
To unsubscribe, e-mail: general-unsubscribe@gump.apache.org
For additional commands, e-mail: general-help@gump.apache.org


Mime
View raw message