gump-general mailing list archives

Site index · List index
Message view « Date » · « Thread »
Top « Date » · « Thread »
From g...@vmgump-vm3.apache.org
Subject BATCH: All dressed up, with nowhere to go...
Date Sun, 26 May 2019 00:52:22 GMT
Dear Gumpmeisters,
            
The following 16 notifys should have been sent

*********************************************************** G U M P
[GUMP@vmgump-vm3]: Module apache-commons failed
[GUMP@vmgump-vm3]: Project commons-daemon-native-buildconf (in module apache-commons) failed
[GUMP@vmgump-vm3]: Project commons-daemon-native (in module apache-commons) failed
[GUMP@vmgump-vm3]: Project java-hamcrest (in module java-hamcrest) failed
[GUMP@vmgump-vm3]: Project commons-net (in module apache-commons) failed
[GUMP@vmgump-vm3]: Project commons-daemon (in module apache-commons) failed
[GUMP@vmgump-vm3]: Project commons-logging-step-1 (in module apache-commons) failed
[GUMP@vmgump-vm3]: Project commons-logging (in module apache-commons) failed
[GUMP@vmgump-vm3]: Module jakarta-bsf failed
[GUMP@vmgump-vm3]: Project fontbox (in module pdfbox) failed
[GUMP@vmgump-vm3]: Module commons-digester-2.x failed
[GUMP@vmgump-vm3]: Project commons-jxpath (in module apache-commons) failed
[GUMP@vmgump-vm3]: Project commons-validator (in module apache-commons) failed
[GUMP@vmgump-vm3]: Project dist-ant (in module ant) failed
[GUMP@vmgump-vm3]: Project commons-bcel (in module apache-commons) failed
[GUMP@vmgump-vm3]: Project commons-exec (in module apache-commons) failed
*********************************************************** G U M P
[GUMP@vmgump-vm3]: Module apache-commons failed
To whom it may engage...
        
This is an automated request, but not an unsolicited one. For 
more information please visit http://gump.apache.org/nagged.html, 
and/or contact the folk at general@gump.apache.org.

Module apache-commons has an issue affecting its community integration,
 and has been outstanding for 2 runs.
The current state of this module is 'Failed', with reason 'Update Failed'.

Full details are available at:
    http://vmgump-vm3.apache.org/apache-commons/index.html

That said, some information snippets are provided here.

The following annotations (debug/informational/warning/error messages) were provided:
 -INFO- Failed with reason update failed



The following work was performed:
http://vmgump-vm3.apache.org/apache-commons/gump_work/update_apache-commons.html
Work Name: update_apache-commons (Type: Update)
Work ended in a state of : Failed
Elapsed: 46 secs
Command Line: svn --quiet update --non-interactive apache-commons 
[Working Directory: /srv/gump/public/workspace/cvs]
---------------------------------------------
svn: E205011: Failure occurred processing one or more externals definitions
---------------------------------------------

To subscribe to this information via syndicated feeds:
- RSS: http://vmgump-vm3.apache.org/apache-commons/rss.xml
- Atom: http://vmgump-vm3.apache.org/apache-commons/atom.xml

============================== Gump Tracking Only ===
Produced by Apache Gump(TM) version 2.3.
Gump Run 20190526000006, vmgump-vm3.apache.org:vmgump:20190526000006
Gump E-mail Identifier (unique within run) #1.

*********************************************************** G U M P
[GUMP@vmgump-vm3]: Project commons-daemon-native-buildconf (in module apache-commons) failed
To whom it may engage...
        
This is an automated request, but not an unsolicited one. For 
more information please visit http://gump.apache.org/nagged.html, 
and/or contact the folk at general@gump.apache.org.

Project commons-daemon-native-buildconf has an issue affecting its community integration,
 and has been outstanding for 2 runs.
The current state of this project is 'Failed', with reason 'Update Failed'.

Full details are available at:
    http://vmgump-vm3.apache.org/apache-commons/commons-daemon-native-buildconf/index.html

That said, some information snippets are provided here.

The following annotations (debug/informational/warning/error messages) were provided:
 -INFO- Failed with reason update failed

To subscribe to this information via syndicated feeds:
- RSS: http://vmgump-vm3.apache.org/apache-commons/commons-daemon-native-buildconf/rss.xml
- Atom: http://vmgump-vm3.apache.org/apache-commons/commons-daemon-native-buildconf/atom.xml

============================== Gump Tracking Only ===
Produced by Apache Gump(TM) version 2.3.
Gump Run 20190526000006, vmgump-vm3.apache.org:vmgump:20190526000006
Gump E-mail Identifier (unique within run) #2.

*********************************************************** G U M P
[GUMP@vmgump-vm3]: Project commons-daemon-native (in module apache-commons) failed
To whom it may engage...
        
This is an automated request, but not an unsolicited one. For 
more information please visit http://gump.apache.org/nagged.html, 
and/or contact the folk at general@gump.apache.org.

Project commons-daemon-native has an issue affecting its community integration,
 and has been outstanding for 2 runs.
The current state of this project is 'Failed', with reason 'Update Failed'.

Full details are available at:
    http://vmgump-vm3.apache.org/apache-commons/commons-daemon-native/index.html

That said, some information snippets are provided here.

The following annotations (debug/informational/warning/error messages) were provided:
 -INFO- Failed with reason update failed

To subscribe to this information via syndicated feeds:
- RSS: http://vmgump-vm3.apache.org/apache-commons/commons-daemon-native/rss.xml
- Atom: http://vmgump-vm3.apache.org/apache-commons/commons-daemon-native/atom.xml

============================== Gump Tracking Only ===
Produced by Apache Gump(TM) version 2.3.
Gump Run 20190526000006, vmgump-vm3.apache.org:vmgump:20190526000006
Gump E-mail Identifier (unique within run) #3.

*********************************************************** G U M P
[GUMP@vmgump-vm3]: Project java-hamcrest (in module java-hamcrest) failed
To whom it may engage...
        
This is an automated request, but not an unsolicited one. For 
more information please visit http://gump.apache.org/nagged.html, 
and/or contact the folk at general@gump.apache.org.

Project java-hamcrest has an issue affecting its community integration.
This issue affects 1 projects,
 and has been outstanding for 833 runs.
The current state of this project is 'Failed', with reason 'Build Failed'.
For reference only, the following projects are affected by this:
    - java-hamcrest :  Provides a library of matcher objects (also known as constra...


Full details are available at:
    http://vmgump-vm3.apache.org/java-hamcrest/java-hamcrest/index.html

That said, some information snippets are provided here.

The following annotations (debug/informational/warning/error messages) were provided:
 -DEBUG- Sole jar output [java-hamcrest-*[0-9T].jar] identifier set to project name
 -DEBUG- (Apache Gump generated) Gradle Init Script in: /srv/gump/public/workspace/java-hamcrest/gump_init_script.gradle
 -INFO- Failed with reason build failed
 -DEBUG- Gradle build in: /srv/gump/public/workspace/java-hamcrest/build.gradle
 -INFO- Failed to extract fallback artifacts from Gump Repository



The following work was performed:
http://vmgump-vm3.apache.org/java-hamcrest/java-hamcrest/gump_work/build_java-hamcrest_java-hamcrest.html
Work Name: build_java-hamcrest_java-hamcrest (Type: Build)
Work ended in a state of : Failed
Elapsed: 4 secs
Command Line: gradle --debug -Djava.awt.headless=true -Dbuild.sysclasspath=only -Dsun.zip.disableMemoryMapping=true
-Dmaven.repo.local=/srv/gump/public/workspace/mvnlocalrepo/java-hamcrest.mvnlocalrepo --refresh-dependencies
--init-script /srv/gump/public/workspace/java-hamcrest/gump_init_script.gradle build 
[Working Directory: /srv/gump/public/workspace/java-hamcrest]
---------------------------------------------
00:18:59.395 [DEBUG] [org.gradle.cache.internal.DefaultFileLockManager] Lock acquired.
00:18:59.396 [DEBUG] [org.gradle.cache.internal.DefaultPersistentDirectoryCache] Invalidating
init remapped class cache for 4c3p5s8mcylple1xz4o2vnckg (/home/gump/.gradle/caches/2.14.1/scripts-remapped/gump_init_script_12yx9mtnnuqfgx94h66zzd6bx/4c3p5s8mcylple1xz4o2vnckg/init57408229)
as it was not closed cleanly.
00:18:59.396 [DEBUG] [org.gradle.cache.internal.DefaultFileLockManager] Releasing lock on
init remapped class cache for 4c3p5s8mcylple1xz4o2vnckg (/home/gump/.gradle/caches/2.14.1/scripts-remapped/gump_init_script_12yx9mtnnuqfgx94h66zzd6bx/4c3p5s8mcylple1xz4o2vnckg/init57408229).
00:18:59.397 [DEBUG] [org.gradle.cache.internal.DefaultFileLockManager] Waiting to acquire
exclusive lock on init remapped class cache for 4c3p5s8mcylple1xz4o2vnckg (/home/gump/.gradle/caches/2.14.1/scripts-remapped/gump_init_script_12yx9mtnnuqfgx94h66zzd6bx/4c3p5s8mcylple1xz4o2vnckg/init57408229).
00:18:59.397 [DEBUG] [org.gradle.cache.internal.DefaultFileLockManager] Lock acquired.
00:18:59.397 [DEBUG] [org.gradle.cache.internal.DefaultPersistentDirectoryCache] Invalidating
init remapped class cache for 4c3p5s8mcylple1xz4o2vnckg (/home/gump/.gradle/caches/2.14.1/scripts-remapped/gump_init_script_12yx9mtnnuqfgx94h66zzd6bx/4c3p5s8mcylple1xz4o2vnckg/init57408229)
as it was not closed cleanly.
00:18:59.401 [DEBUG] [org.gradle.cache.internal.DefaultFileLockManager] Waiting to acquire
shared lock on init generic class cache for initialization script '/srv/gump/public/workspace/java-hamcrest/gump_init_script.gradle'
(/home/gump/.gradle/caches/2.14.1/scripts/4c3p5s8mcylple1xz4o2vnckg/init/init57408229).
00:18:59.404 [DEBUG] [org.gradle.cache.internal.DefaultFileLockManager] Lock acquired.
00:18:59.404 [DEBUG] [org.gradle.cache.internal.DefaultPersistentDirectoryCache] Invalidating
init generic class cache for initialization script '/srv/gump/public/workspace/java-hamcrest/gump_init_script.gradle'
(/home/gump/.gradle/caches/2.14.1/scripts/4c3p5s8mcylple1xz4o2vnckg/init/init57408229) as
it was not closed cleanly.
00:18:59.404 [DEBUG] [org.gradle.cache.internal.DefaultFileLockManager] Releasing lock on
init generic class cache for initialization script '/srv/gump/public/workspace/java-hamcrest/gump_init_script.gradle'
(/home/gump/.gradle/caches/2.14.1/scripts/4c3p5s8mcylple1xz4o2vnckg/init/init57408229).
00:18:59.405 [DEBUG] [org.gradle.cache.internal.DefaultFileLockManager] Waiting to acquire
exclusive lock on init generic class cache for initialization script '/srv/gump/public/workspace/java-hamcrest/gump_init_script.gradle'
(/home/gump/.gradle/caches/2.14.1/scripts/4c3p5s8mcylple1xz4o2vnckg/init/init57408229).
00:18:59.405 [DEBUG] [org.gradle.cache.internal.DefaultFileLockManager] Lock acquired.
00:18:59.406 [DEBUG] [org.gradle.cache.internal.DefaultPersistentDirectoryCache] Invalidating
init generic class cache for initialization script '/srv/gump/public/workspace/java-hamcrest/gump_init_script.gradle'
(/home/gump/.gradle/caches/2.14.1/scripts/4c3p5s8mcylple1xz4o2vnckg/init/init57408229) as
it was not closed cleanly.
00:18:59.406 [INFO] [org.gradle.groovy.scripts.internal.DefaultScriptCompilationHandler] Compiling
initialization script '/srv/gump/public/workspace/java-hamcrest/gump_init_script.gradle' using
BuildScriptTransformer.
00:18:59.752 [DEBUG] [org.gradle.groovy.scripts.internal.DefaultScriptCompilationHandler]
Timing: Writing script to cache at /home/gump/.gradle/caches/2.14.1/scripts/4c3p5s8mcylple1xz4o2vnckg/init/init57408229/classes
took: 0.346 secs
00:18:59.753 [DEBUG] [org.gradle.cache.internal.DefaultFileLockManager] Releasing lock on
init generic class cache for initialization script '/srv/gump/public/workspace/java-hamcrest/gump_init_script.gradle'
(/home/gump/.gradle/caches/2.14.1/scripts/4c3p5s8mcylple1xz4o2vnckg/init/init57408229).
00:18:59.753 [DEBUG] [org.gradle.cache.internal.DefaultFileLockManager] Waiting to acquire
shared lock on init generic class cache for initialization script '/srv/gump/public/workspace/java-hamcrest/gump_init_script.gradle'
(/home/gump/.gradle/caches/2.14.1/scripts/4c3p5s8mcylple1xz4o2vnckg/init/init57408229).
00:18:59.753 [DEBUG] [org.gradle.cache.internal.DefaultFileLockManager] Lock acquired.
00:18:59.754 [DEBUG] [org.gradle.cache.internal.DefaultFileLockManager] Releasing lock on
init generic class cache for initialization script '/srv/gump/public/workspace/java-hamcrest/gump_init_script.gradle'
(/home/gump/.gradle/caches/2.14.1/scripts/4c3p5s8mcylple1xz4o2vnckg/init/init57408229).
00:18:59.776 [DEBUG] [org.gradle.cache.internal.DefaultFileLockManager] Releasing lock on
init remapped class cache for 4c3p5s8mcylple1xz4o2vnckg (/home/gump/.gradle/caches/2.14.1/scripts-remapped/gump_init_script_12yx9mtnnuqfgx94h66zzd6bx/4c3p5s8mcylple1xz4o2vnckg/init57408229).
00:18:59.776 [DEBUG] [org.gradle.cache.internal.DefaultFileLockManager] Waiting to acquire
shared lock on init remapped class cache for 4c3p5s8mcylple1xz4o2vnckg (/home/gump/.gradle/caches/2.14.1/scripts-remapped/gump_init_script_12yx9mtnnuqfgx94h66zzd6bx/4c3p5s8mcylple1xz4o2vnckg/init57408229).
00:18:59.776 [DEBUG] [org.gradle.cache.internal.DefaultFileLockManager] Lock acquired.
00:18:59.777 [DEBUG] [org.gradle.cache.internal.DefaultFileLockManager] Releasing lock on
init remapped class cache for 4c3p5s8mcylple1xz4o2vnckg (/home/gump/.gradle/caches/2.14.1/scripts-remapped/gump_init_script_12yx9mtnnuqfgx94h66zzd6bx/4c3p5s8mcylple1xz4o2vnckg/init57408229).
00:19:00.087 [DEBUG] [org.gradle.initialization.buildsrc.BuildSourceBuilder] Starting to build
the build sources.
00:19:00.087 [DEBUG] [org.gradle.initialization.buildsrc.BuildSourceBuilder] Gradle source
dir does not exist. We leave.
00:19:00.092 [DEBUG] [org.gradle.initialization.DefaultGradlePropertiesLoader] Found env project
properties: []
00:19:00.093 [DEBUG] [org.gradle.initialization.DefaultGradlePropertiesLoader] Found system
project properties: []
00:19:00.119 [DEBUG] [org.gradle.cache.internal.DefaultFileLockManager] Waiting to acquire
shared lock on cp_settings remapped class cache for 64g8nj5ap81xt4wz300ry8jej (/home/gump/.gradle/caches/2.14.1/scripts-remapped/settings_3zs6mr5f4qq49n5mpvcvec71o/64g8nj5ap81xt4wz300ry8jej/cp_settings57408229).
00:19:00.121 [DEBUG] [org.gradle.cache.internal.DefaultFileLockManager] Lock acquired.
00:19:00.124 [DEBUG] [org.gradle.cache.internal.DefaultFileLockManager] Releasing lock on
cp_settings remapped class cache for 64g8nj5ap81xt4wz300ry8jej (/home/gump/.gradle/caches/2.14.1/scripts-remapped/settings_3zs6mr5f4qq49n5mpvcvec71o/64g8nj5ap81xt4wz300ry8jej/cp_settings57408229).
00:19:00.127 [DEBUG] [org.gradle.cache.internal.DefaultFileLockManager] Waiting to acquire
shared lock on settings remapped class cache for 64g8nj5ap81xt4wz300ry8jej (/home/gump/.gradle/caches/2.14.1/scripts-remapped/settings_3zs6mr5f4qq49n5mpvcvec71o/64g8nj5ap81xt4wz300ry8jej/settings57408229).
00:19:00.129 [DEBUG] [org.gradle.cache.internal.DefaultFileLockManager] Lock acquired.
00:19:00.131 [DEBUG] [org.gradle.cache.internal.DefaultFileLockManager] Releasing lock on
settings remapped class cache for 64g8nj5ap81xt4wz300ry8jej (/home/gump/.gradle/caches/2.14.1/scripts-remapped/settings_3zs6mr5f4qq49n5mpvcvec71o/64g8nj5ap81xt4wz300ry8jej/settings57408229).
00:19:00.181 [ERROR] [org.gradle.BuildExceptionReporter] 
00:19:00.182 [ERROR] [org.gradle.BuildExceptionReporter] FAILURE: Build failed with an exception.
00:19:00.182 [ERROR] [org.gradle.BuildExceptionReporter] 
00:19:00.183 [ERROR] [org.gradle.BuildExceptionReporter] * Where:
00:19:00.183 [ERROR] [org.gradle.BuildExceptionReporter] Settings file '/srv/gump/public/workspace/java-hamcrest/settings.gradle'
line: 1
00:19:00.183 [ERROR] [org.gradle.BuildExceptionReporter] 
00:19:00.187 [ERROR] [org.gradle.BuildExceptionReporter] * What went wrong:
00:19:00.188 [ERROR] [org.gradle.BuildExceptionReporter] A problem occurred evaluating settings
'java-hamcrest'.
00:19:00.189 [ERROR] [org.gradle.BuildExceptionReporter] > Could not find method enableFeaturePreview()
for arguments [STABLE_PUBLISHING] on settings 'java-hamcrest' of type org.gradle.initialization.DefaultSettings.
00:19:00.189 [ERROR] [org.gradle.BuildExceptionReporter] 
00:19:00.189 [ERROR] [org.gradle.BuildExceptionReporter] * Try:
00:19:00.189 [ERROR] [org.gradle.BuildExceptionReporter] Run with --stacktrace option to get
the stack trace. 
00:19:00.190 [LIFECYCLE] [org.gradle.BuildResultLogger] 
00:19:00.191 [LIFECYCLE] [org.gradle.BuildResultLogger] BUILD FAILED
00:19:00.191 [LIFECYCLE] [org.gradle.BuildResultLogger] 
00:19:00.192 [LIFECYCLE] [org.gradle.BuildResultLogger] Total time: 4.197 secs
00:19:00.195 [DEBUG] [org.gradle.cache.internal.DefaultCacheAccess] Cache Plugin Resolution
Cache (/home/gump/.gradle/caches/2.14.1/plugin-resolution) was closed 0 times.
---------------------------------------------

To subscribe to this information via syndicated feeds:
- RSS: http://vmgump-vm3.apache.org/java-hamcrest/java-hamcrest/rss.xml
- Atom: http://vmgump-vm3.apache.org/java-hamcrest/java-hamcrest/atom.xml

============================== Gump Tracking Only ===
Produced by Apache Gump(TM) version 2.3.
Gump Run 20190526000006, vmgump-vm3.apache.org:vmgump:20190526000006
Gump E-mail Identifier (unique within run) #4.

*********************************************************** G U M P
[GUMP@vmgump-vm3]: Project commons-net (in module apache-commons) failed
To whom it may engage...
        
This is an automated request, but not an unsolicited one. For 
more information please visit http://gump.apache.org/nagged.html, 
and/or contact the folk at general@gump.apache.org.

Project commons-net has an issue affecting its community integration,
 and has been outstanding for 2 runs.
The current state of this project is 'Failed', with reason 'Update Failed'.

Full details are available at:
    http://vmgump-vm3.apache.org/apache-commons/commons-net/index.html

That said, some information snippets are provided here.

The following annotations (debug/informational/warning/error messages) were provided:
 -INFO- Failed with reason update failed
 -DEBUG- Extracted fallback artifacts from Gump Repository

To subscribe to this information via syndicated feeds:
- RSS: http://vmgump-vm3.apache.org/apache-commons/commons-net/rss.xml
- Atom: http://vmgump-vm3.apache.org/apache-commons/commons-net/atom.xml

============================== Gump Tracking Only ===
Produced by Apache Gump(TM) version 2.3.
Gump Run 20190526000006, vmgump-vm3.apache.org:vmgump:20190526000006
Gump E-mail Identifier (unique within run) #5.

*********************************************************** G U M P
[GUMP@vmgump-vm3]: Project commons-daemon (in module apache-commons) failed
To whom it may engage...
        
This is an automated request, but not an unsolicited one. For 
more information please visit http://gump.apache.org/nagged.html, 
and/or contact the folk at general@gump.apache.org.

Project commons-daemon has an issue affecting its community integration,
 and has been outstanding for 2 runs.
The current state of this project is 'Failed', with reason 'Update Failed'.

Full details are available at:
    http://vmgump-vm3.apache.org/apache-commons/commons-daemon/index.html

That said, some information snippets are provided here.

The following annotations (debug/informational/warning/error messages) were provided:
 -INFO- Failed with reason update failed
 -DEBUG- Extracted fallback artifacts from Gump Repository

To subscribe to this information via syndicated feeds:
- RSS: http://vmgump-vm3.apache.org/apache-commons/commons-daemon/rss.xml
- Atom: http://vmgump-vm3.apache.org/apache-commons/commons-daemon/atom.xml

============================== Gump Tracking Only ===
Produced by Apache Gump(TM) version 2.3.
Gump Run 20190526000006, vmgump-vm3.apache.org:vmgump:20190526000006
Gump E-mail Identifier (unique within run) #6.

*********************************************************** G U M P
[GUMP@vmgump-vm3]: Project commons-logging-step-1 (in module apache-commons) failed
To whom it may engage...
        
This is an automated request, but not an unsolicited one. For 
more information please visit http://gump.apache.org/nagged.html, 
and/or contact the folk at general@gump.apache.org.

Project commons-logging-step-1 has an issue affecting its community integration,
 and has been outstanding for 2 runs.
The current state of this project is 'Failed', with reason 'Update Failed'.

Full details are available at:
    http://vmgump-vm3.apache.org/apache-commons/commons-logging-step-1/index.html

That said, some information snippets are provided here.

The following annotations (debug/informational/warning/error messages) were provided:
 -DEBUG- Dependency on logging-log4j-12 exists, no need to add for property log4j12.jar.
 -DEBUG- Dependency on avalon-logkit exists, no need to add for property logkit.jar.
 -DEBUG- Dependency on avalon-framework-api exists, no need to add for property avalon-framework.jar.
 -INFO- Failed with reason update failed

To subscribe to this information via syndicated feeds:
- RSS: http://vmgump-vm3.apache.org/apache-commons/commons-logging-step-1/rss.xml
- Atom: http://vmgump-vm3.apache.org/apache-commons/commons-logging-step-1/atom.xml

============================== Gump Tracking Only ===
Produced by Apache Gump(TM) version 2.3.
Gump Run 20190526000006, vmgump-vm3.apache.org:vmgump:20190526000006
Gump E-mail Identifier (unique within run) #7.

*********************************************************** G U M P
[GUMP@vmgump-vm3]: Project commons-logging (in module apache-commons) failed
To whom it may engage...
        
This is an automated request, but not an unsolicited one. For 
more information please visit http://gump.apache.org/nagged.html, 
and/or contact the folk at general@gump.apache.org.

Project commons-logging has an issue affecting its community integration,
 and has been outstanding for 2 runs.
The current state of this project is 'Failed', with reason 'Update Failed'.

Full details are available at:
    http://vmgump-vm3.apache.org/apache-commons/commons-logging/index.html

That said, some information snippets are provided here.

The following annotations (debug/informational/warning/error messages) were provided:
 -DEBUG- Dependency on logging-log4j-12 exists, no need to add for property log4j13.jar.
 -DEBUG- Dependency on avalon-logkit exists, no need to add for property logkit.jar.
 -DEBUG- Dependency on avalon-framework-api exists, no need to add for property avalon-framework.jar.
 -INFO- Failed with reason update failed
 -DEBUG- Extracted fallback artifacts from Gump Repository

To subscribe to this information via syndicated feeds:
- RSS: http://vmgump-vm3.apache.org/apache-commons/commons-logging/rss.xml
- Atom: http://vmgump-vm3.apache.org/apache-commons/commons-logging/atom.xml

============================== Gump Tracking Only ===
Produced by Apache Gump(TM) version 2.3.
Gump Run 20190526000006, vmgump-vm3.apache.org:vmgump:20190526000006
Gump E-mail Identifier (unique within run) #8.

*********************************************************** G U M P
[GUMP@vmgump-vm3]: Module jakarta-bsf failed
To whom it may engage...
        
This is an automated request, but not an unsolicited one. For 
more information please visit http://gump.apache.org/nagged.html, 
and/or contact the folk at general@gump.apache.org.

Module jakarta-bsf has an issue affecting its community integration,
 and has been outstanding for 2 runs.
The current state of this module is 'Failed', with reason 'Update Failed'.

Full details are available at:
    http://vmgump-vm3.apache.org/jakarta-bsf/index.html

That said, some information snippets are provided here.

The following annotations (debug/informational/warning/error messages) were provided:
 -INFO- Failed with reason update failed



The following work was performed:
http://vmgump-vm3.apache.org/jakarta-bsf/gump_work/update_jakarta-bsf.html
Work Name: update_jakarta-bsf (Type: Update)
Work ended in a state of : Failed
Elapsed: 
Command Line: svn --quiet update --non-interactive jakarta-bsf 
[Working Directory: /srv/gump/public/workspace/cvs]
---------------------------------------------
svn: E160005: Target path '/commons/proper/bsf/trunk' does not exist
---------------------------------------------

To subscribe to this information via syndicated feeds:
- RSS: http://vmgump-vm3.apache.org/jakarta-bsf/rss.xml
- Atom: http://vmgump-vm3.apache.org/jakarta-bsf/atom.xml

============================== Gump Tracking Only ===
Produced by Apache Gump(TM) version 2.3.
Gump Run 20190526000006, vmgump-vm3.apache.org:vmgump:20190526000006
Gump E-mail Identifier (unique within run) #9.

*********************************************************** G U M P
[GUMP@vmgump-vm3]: Project fontbox (in module pdfbox) failed
To whom it may engage...
        
This is an automated request, but not an unsolicited one. For 
more information please visit http://gump.apache.org/nagged.html, 
and/or contact the folk at general@gump.apache.org.

Project fontbox has an issue affecting its community integration.
This issue affects 1 projects,
 and has been outstanding for 347 runs.
The current state of this project is 'Failed', with reason 'Build Failed'.
For reference only, the following projects are affected by this:
    - fontbox :  Apache PDFBox is an open source Java PDF library for working...


Full details are available at:
    http://vmgump-vm3.apache.org/pdfbox/fontbox/index.html

That said, some information snippets are provided here.

The following annotations (debug/informational/warning/error messages) were provided:
 -DEBUG- Sole jar output [fontbox-*[0-9T].jar] identifier set to project name
 -INFO- Optional dependency commons-logging failed with reason update failed
 -DEBUG- (Apache Gump generated) Apache Maven Settings in: /srv/gump/public/workspace/pdfbox/fontbox/gump_mvn_settings.xml
 -INFO- Failed with reason build failed
 -DEBUG- Maven POM in: /srv/gump/public/workspace/pdfbox/fontbox/pom.xml
 -INFO- Failed to extract fallback artifacts from Gump Repository



The following work was performed:
http://vmgump-vm3.apache.org/pdfbox/fontbox/gump_work/build_pdfbox_fontbox.html
Work Name: build_pdfbox_fontbox (Type: Build)
Work ended in a state of : Failed
Elapsed: 4 secs
Command Line: /opt/maven3/bin/mvn --batch-mode --settings /srv/gump/public/workspace/pdfbox/fontbox/gump_mvn_settings.xml
package 
[Working Directory: /srv/gump/public/workspace/pdfbox/fontbox]
M2_HOME: /opt/maven3
---------------------------------------------
[INFO] Scanning for projects...
[INFO]                                                                         
[INFO] ------------------------------------------------------------------------
[INFO] Building Apache FontBox 3.0.0-SNAPSHOT
[INFO] ------------------------------------------------------------------------
[INFO] Downloading: http://localhost:8192/maven2/commons-logging/commons-logging/1.2/commons-logging-1.2.jar
[INFO] Downloaded: http://localhost:8192/maven2/commons-logging/commons-logging/1.2/commons-logging-1.2.jar
(61 KB at 736.3 KB/sec)
[INFO] 
[INFO] --- maven-enforcer-plugin:1.4.1:enforce (default) @ fontbox ---
[INFO] Downloading: http://localhost:8192/maven2/org/apache/maven/enforcer/enforcer-api/1.4.1/enforcer-api-1.4.1.pom
[INFO] Downloaded: http://localhost:8192/maven2/org/apache/maven/enforcer/enforcer-api/1.4.1/enforcer-api-1.4.1.pom
(3 KB at 153.2 KB/sec)
[INFO] Downloading: http://localhost:8192/maven2/org/apache/maven/enforcer/enforcer-rules/1.4.1/enforcer-rules-1.4.1.pom
[INFO] Downloaded: http://localhost:8192/maven2/org/apache/maven/enforcer/enforcer-rules/1.4.1/enforcer-rules-1.4.1.pom
(4 KB at 241.4 KB/sec)
[INFO] Downloading: http://localhost:8192/maven2/org/apache/maven/plugin-testing/maven-plugin-testing-harness/1.3/maven-plugin-testing-harness-1.3.pom
[INFO] Downloaded: http://localhost:8192/maven2/org/apache/maven/plugin-testing/maven-plugin-testing-harness/1.3/maven-plugin-testing-harness-1.3.pom
(4 KB at 210.5 KB/sec)
[INFO] Downloading: http://localhost:8192/maven2/org/apache/maven/plugin-testing/maven-plugin-testing/1.3/maven-plugin-testing-1.3.pom
[INFO] Downloaded: http://localhost:8192/maven2/org/apache/maven/plugin-testing/maven-plugin-testing/1.3/maven-plugin-testing-1.3.pom
(10 KB at 547.6 KB/sec)
[INFO] Downloading: http://localhost:8192/maven2/org/codehaus/plexus/plexus-archiver/2.2/plexus-archiver-2.2.pom
[INFO] Downloaded: http://localhost:8192/maven2/org/codehaus/plexus/plexus-archiver/2.2/plexus-archiver-2.2.pom
(4 KB at 196.1 KB/sec)
[INFO] Downloading: http://localhost:8192/maven2/org/codehaus/plexus/plexus-components/1.1.20/plexus-components-1.1.20.pom
[INFO] Downloaded: http://localhost:8192/maven2/org/codehaus/plexus/plexus-components/1.1.20/plexus-components-1.1.20.pom
(3 KB at 210.4 KB/sec)
[INFO] Downloading: http://localhost:8192/maven2/org/codehaus/plexus/plexus-io/2.0.4/plexus-io-2.0.4.pom
[INFO] Downloaded: http://localhost:8192/maven2/org/codehaus/plexus/plexus-io/2.0.4/plexus-io-2.0.4.pom
(2 KB at 105.8 KB/sec)
[INFO] Downloading: http://localhost:8192/maven2/org/apache/maven/enforcer/enforcer-api/1.4.1/enforcer-api-1.4.1.jar
[INFO] Downloading: http://localhost:8192/maven2/org/apache/maven/enforcer/enforcer-rules/1.4.1/enforcer-rules-1.4.1.jar
[INFO] Downloading: http://localhost:8192/maven2/org/apache/maven/plugin-testing/maven-plugin-testing-harness/1.3/maven-plugin-testing-harness-1.3.jar
[INFO] Downloading: http://localhost:8192/maven2/org/codehaus/plexus/plexus-archiver/2.2/plexus-archiver-2.2.jar
[INFO] Downloading: http://localhost:8192/maven2/org/codehaus/plexus/plexus-io/2.0.4/plexus-io-2.0.4.jar
[INFO] Downloaded: http://localhost:8192/maven2/org/apache/maven/enforcer/enforcer-api/1.4.1/enforcer-api-1.4.1.jar
(12 KB at 291.4 KB/sec)
[INFO] Downloaded: http://localhost:8192/maven2/org/apache/maven/enforcer/enforcer-rules/1.4.1/enforcer-rules-1.4.1.jar
(97 KB at 2355.6 KB/sec)
[INFO] Downloaded: http://localhost:8192/maven2/org/apache/maven/plugin-testing/maven-plugin-testing-harness/1.3/maven-plugin-testing-harness-1.3.jar
(35 KB at 841.1 KB/sec)
[INFO] Downloaded: http://localhost:8192/maven2/org/codehaus/plexus/plexus-io/2.0.4/plexus-io-2.0.4.jar
(57 KB at 1388.1 KB/sec)
[INFO] Downloaded: http://localhost:8192/maven2/org/codehaus/plexus/plexus-archiver/2.2/plexus-archiver-2.2.jar
(181 KB at 4301.0 KB/sec)
[WARNING] Rule 0: org.apache.maven.plugins.enforcer.RequireMavenVersion failed with message:
Detected Maven Version: 3.3.9 is not in the allowed range 3.5.
[INFO] ------------------------------------------------------------------------
[INFO] BUILD FAILURE
[INFO] ------------------------------------------------------------------------
[INFO] Total time: 2.757 s
[INFO] Finished at: 2019-05-26T00:45:53+00:00
[INFO] Final Memory: 17M/178M
[INFO] ------------------------------------------------------------------------
[ERROR] Failed to execute goal org.apache.maven.plugins:maven-enforcer-plugin:1.4.1:enforce
(default) on project fontbox: Some Enforcer rules have failed. Look above for specific messages
explaining why the rule failed. -> [Help 1]
[ERROR] 
[ERROR] To see the full stack trace of the errors, re-run Maven with the -e switch.
[ERROR] Re-run Maven using the -X switch to enable full debug logging.
[ERROR] 
[ERROR] For more information about the errors and possible solutions, please read the following
articles:
[ERROR] [Help 1] http://cwiki.apache.org/confluence/display/MAVEN/MojoExecutionException
---------------------------------------------

To subscribe to this information via syndicated feeds:
- RSS: http://vmgump-vm3.apache.org/pdfbox/fontbox/rss.xml
- Atom: http://vmgump-vm3.apache.org/pdfbox/fontbox/atom.xml

============================== Gump Tracking Only ===
Produced by Apache Gump(TM) version 2.3.
Gump Run 20190526000006, vmgump-vm3.apache.org:vmgump:20190526000006
Gump E-mail Identifier (unique within run) #10.

*********************************************************** G U M P
[GUMP@vmgump-vm3]: Module commons-digester-2.x failed
To whom it may engage...
        
This is an automated request, but not an unsolicited one. For 
more information please visit http://gump.apache.org/nagged.html, 
and/or contact the folk at general@gump.apache.org.

Module commons-digester-2.x has an issue affecting its community integration,
 and has been outstanding for 2 runs.
The current state of this module is 'Failed', with reason 'Update Failed'.

Full details are available at:
    http://vmgump-vm3.apache.org/commons-digester-2.x/index.html

That said, some information snippets are provided here.

The following annotations (debug/informational/warning/error messages) were provided:
 -INFO- Failed with reason update failed



The following work was performed:
http://vmgump-vm3.apache.org/commons-digester-2.x/gump_work/update_commons-digester-2.x.html
Work Name: update_commons-digester-2.x (Type: Update)
Work ended in a state of : Failed
Elapsed: 1 sec
Command Line: svn --quiet update --non-interactive commons-digester-2.x 
[Working Directory: /srv/gump/public/workspace/cvs]
---------------------------------------------
svn: E160005: Target path '/commons/proper/digester/branches/DIGESTER_2_X' does not exist
---------------------------------------------

To subscribe to this information via syndicated feeds:
- RSS: http://vmgump-vm3.apache.org/commons-digester-2.x/rss.xml
- Atom: http://vmgump-vm3.apache.org/commons-digester-2.x/atom.xml

============================== Gump Tracking Only ===
Produced by Apache Gump(TM) version 2.3.
Gump Run 20190526000006, vmgump-vm3.apache.org:vmgump:20190526000006
Gump E-mail Identifier (unique within run) #11.

*********************************************************** G U M P
[GUMP@vmgump-vm3]: Project commons-jxpath (in module apache-commons) failed
To whom it may engage...
        
This is an automated request, but not an unsolicited one. For 
more information please visit http://gump.apache.org/nagged.html, 
and/or contact the folk at general@gump.apache.org.

Project commons-jxpath has an issue affecting its community integration,
 and has been outstanding for 2 runs.
The current state of this project is 'Failed', with reason 'Update Failed'.

Full details are available at:
    http://vmgump-vm3.apache.org/apache-commons/commons-jxpath/index.html

That said, some information snippets are provided here.

The following annotations (debug/informational/warning/error messages) were provided:
 -DEBUG- Sole jar output [commons-jxpath-*[0-9T].jar] identifier set to project name
 -INFO- Optional dependency commons-beanutils prerequisite failed with reason update failed
 -INFO- Failed with reason update failed
 -DEBUG- Extracted fallback artifacts from Gump Repository

To subscribe to this information via syndicated feeds:
- RSS: http://vmgump-vm3.apache.org/apache-commons/commons-jxpath/rss.xml
- Atom: http://vmgump-vm3.apache.org/apache-commons/commons-jxpath/atom.xml

============================== Gump Tracking Only ===
Produced by Apache Gump(TM) version 2.3.
Gump Run 20190526000006, vmgump-vm3.apache.org:vmgump:20190526000006
Gump E-mail Identifier (unique within run) #12.

*********************************************************** G U M P
[GUMP@vmgump-vm3]: Project commons-validator (in module apache-commons) failed
To whom it may engage...
        
This is an automated request, but not an unsolicited one. For 
more information please visit http://gump.apache.org/nagged.html, 
and/or contact the folk at general@gump.apache.org.

Project commons-validator has an issue affecting its community integration,
 and has been outstanding for 2 runs.
The current state of this project is 'Failed', with reason 'Update Failed'.

Full details are available at:
    http://vmgump-vm3.apache.org/apache-commons/commons-validator/index.html

That said, some information snippets are provided here.

The following annotations (debug/informational/warning/error messages) were provided:
 -DEBUG- Sole jar output [commons-validator-*[0-9T].jar] identifier set to project name
 -INFO- Optional dependency commons-digester prerequisite failed with reason update failed
 -INFO- Optional dependency commons-beanutils prerequisite failed with reason update failed
 -INFO- Optional dependency commons-logging failed with reason update failed
 -INFO- Failed with reason update failed
 -DEBUG- Extracted fallback artifacts from Gump Repository

To subscribe to this information via syndicated feeds:
- RSS: http://vmgump-vm3.apache.org/apache-commons/commons-validator/rss.xml
- Atom: http://vmgump-vm3.apache.org/apache-commons/commons-validator/atom.xml

============================== Gump Tracking Only ===
Produced by Apache Gump(TM) version 2.3.
Gump Run 20190526000006, vmgump-vm3.apache.org:vmgump:20190526000006
Gump E-mail Identifier (unique within run) #13.

*********************************************************** G U M P
[GUMP@vmgump-vm3]: Project dist-ant (in module ant) failed
To whom it may engage...
        
This is an automated request, but not an unsolicited one. For 
more information please visit http://gump.apache.org/nagged.html, 
and/or contact the folk at general@gump.apache.org.

Project dist-ant has an issue affecting its community integration.
This issue affects 4 projects,
 and has been outstanding for 2 runs.
The current state of this project is 'Failed', with reason 'Build Failed'.
For reference only, the following projects are affected by this:
    - dist-ant :  Java based build tool
    - dist-xalan2 :  Release 2.x of the Xalan-Java XSLT processor
    - org.apache.dist-ant :  Java based build tool
    - test-ant :  Java based build tool


Full details are available at:
    http://vmgump-vm3.apache.org/ant/dist-ant/index.html

That said, some information snippets are provided here.

The following annotations (debug/informational/warning/error messages) were provided:
 -INFO- Optional dependency jakarta-bsf prerequisite failed with reason update failed
 -INFO- Optional dependency commons-logging failed with reason update failed
 -INFO- Optional dependency commons-net failed with reason update failed
 -INFO- Failed with reason build failed
 -INFO- Failed to extract fallback artifacts from Gump Repository



The following work was performed:
http://vmgump-vm3.apache.org/ant/dist-ant/gump_work/build_ant_dist-ant.html
Work Name: build_ant_dist-ant (Type: Build)
Work ended in a state of : Failed
Elapsed: 25 secs
Command Line: /usr/lib/jvm/java-8-oracle/bin/java -Djava.awt.headless=true -Dbuild.sysclasspath=only
-Dsun.zip.disableMemoryMapping=true -Xbootclasspath/p:/srv/gump/public/workspace/xml-xerces2/build/xercesImpl.jar:/srv/gump/public/workspace/xml-commons/java/external/build/xml-apis.jar:/srv/gump/public/workspace/xml-xalan/build/xalan-unbundled.jar
org.apache.tools.ant.Main -Dgump.merge=/srv/gump/public/gump/work/merge.xml -Dchmod.fail=false
-Doptional.jars.whenmanifestonly=create distribution 
[Working Directory: /srv/gump/public/workspace/ant]
CLASSPATH: /usr/lib/jvm/java-8-oracle/lib/tools.jar:/srv/gump/public/workspace/ant/build/classes:/srv/gump/public/workspace/ant/dist/lib/ant.jar:/srv/gump/public/workspace/ant/dist/lib/ant-launcher.jar:/srv/gump/public/workspace/ant/dist/lib/ant-jmf.jar:/srv/gump/public/workspace/ant/dist/lib/ant-junit.jar:/srv/gump/public/workspace/ant/dist/lib/ant-junit4.jar:/srv/gump/public/workspace/ant/dist/lib/ant-swing.jar:/srv/gump/public/workspace/ant/dist/lib/ant-apache-resolver.jar:/srv/gump/public/workspace/ant/dist/lib/ant-apache-xalan2.jar:/srv/gump/public/workspace/xml-commons/java/build/resolver.jar:/srv/gump/public/workspace/xml-commons/java/external/build/xml-apis-ext.jar:/srv/gump/packages/antlr/antlr-3.1.3.jar:/srv/gump/public/workspace/ant-contrib/lib/bcel/jars/bcel-5.1.jar:commons-logging-gump-20190525.jar:commons-logging-api-gump-20190525.jar:commons-net-gump-20190525.jar:commons-net-ftp-gump-20190525.jar:/srv/gump/packages/jaf-1.1ea/activation.jar:bsf-gump-20190525.jar:/srv/gu
 mp/packages/apache-attic/jakarta-regexp-1.5.jar:/srv/gump/public/workspace/jakarta-servletapi-5/jsr154/dist/lib/servlet-api.jar:/srv/gump/packages/javamail-1.4/mail.jar:/srv/gump/packages/javamail-1.4/lib/mailapi.jar:/srv/gump/packages/jdepend-2.6/lib/jdepend.jar:/srv/gump/packages/jsch/jsch-0.1.45.jar:/srv/gump/public/workspace/junit/target/junit-4.13-SNAPSHOT.jar:/srv/gump/packages/hamcrest/hamcrest-core-1.3.jar:/srv/gump/packages/hamcrest/hamcrest-library-1.3.jar:/srv/gump/public/workspace/logging-log4j-12/target/log4j-1.2.18-SNAPSHOT.jar:/srv/gump/packages/apache-attic/oro-2.0.8.jar:/srv/gump/public/workspace/xz-java/build/jar-20190526/xz.jar
---------------------------------------------
  [javadoc]      * See the encoding table in the JAI Programming Guide</a>.
  [javadoc]                                                           ^
  [javadoc] /srv/gump/public/workspace/ant/src/main/org/apache/tools/ant/taskdefs/optional/net/FTP.java:1481:
error: reference not found
  [javadoc]      * @see org.apache.commons.net.ftp.FTPClientConfig
  [javadoc]             ^
  [javadoc] /srv/gump/public/workspace/ant/src/main/org/apache/tools/ant/taskdefs/optional/net/FTP.java:1494:
error: reference not found
  [javadoc]      * @see org.apache.commons.net.ftp.FTPClientConfig
  [javadoc]             ^
  [javadoc] /srv/gump/public/workspace/ant/src/main/org/apache/tools/ant/taskdefs/optional/net/FTP.java:1507:
error: reference not found
  [javadoc]      * @see org.apache.commons.net.ftp.FTPClientConfig
  [javadoc]             ^
  [javadoc] /srv/gump/public/workspace/ant/src/main/org/apache/tools/ant/taskdefs/optional/net/FTP.java:1520:
error: reference not found
  [javadoc]      * @see org.apache.commons.net.ftp.FTPClientConfig
  [javadoc]             ^
  [javadoc] /srv/gump/public/workspace/ant/src/main/org/apache/tools/ant/taskdefs/optional/net/FTP.java:1533:
error: reference not found
  [javadoc]      * @see org.apache.commons.net.ftp.FTPClientConfig
  [javadoc]             ^
  [javadoc] /srv/gump/public/workspace/ant/src/main/org/apache/tools/ant/taskdefs/optional/net/FTP.java:1547:
error: reference not found
  [javadoc]      * @see org.apache.commons.net.ftp.FTPClientConfig
  [javadoc]             ^
  [javadoc] /srv/gump/public/workspace/ant/src/main/org/apache/tools/ant/taskdefs/optional/net/FTPTask.java:504:
error: reference not found
  [javadoc]      * @see org.apache.commons.net.ftp.FTPClientConfig
  [javadoc]             ^
  [javadoc] /srv/gump/public/workspace/ant/src/main/org/apache/tools/ant/taskdefs/optional/net/FTPTask.java:517:
error: reference not found
  [javadoc]      * @see org.apache.commons.net.ftp.FTPClientConfig
  [javadoc]             ^
  [javadoc] /srv/gump/public/workspace/ant/src/main/org/apache/tools/ant/taskdefs/optional/net/FTPTask.java:530:
error: reference not found
  [javadoc]      * @see org.apache.commons.net.ftp.FTPClientConfig
  [javadoc]             ^
  [javadoc] /srv/gump/public/workspace/ant/src/main/org/apache/tools/ant/taskdefs/optional/net/FTPTask.java:543:
error: reference not found
  [javadoc]      * @see org.apache.commons.net.ftp.FTPClientConfig
  [javadoc]             ^
  [javadoc] /srv/gump/public/workspace/ant/src/main/org/apache/tools/ant/taskdefs/optional/net/FTPTask.java:556:
error: reference not found
  [javadoc]      * @see org.apache.commons.net.ftp.FTPClientConfig
  [javadoc]             ^
  [javadoc] /srv/gump/public/workspace/ant/src/main/org/apache/tools/ant/taskdefs/optional/net/FTPTask.java:570:
error: reference not found
  [javadoc]      * @see org.apache.commons.net.ftp.FTPClientConfig
  [javadoc]             ^
  [javadoc] Building index for all the packages and classes...
  [javadoc] Building index for all classes...
  [javadoc] Generating /srv/gump/public/workspace/ant/build/javadocs/help-doc.html...
  [javadoc] Note: Custom tags that could override future standard tags:  @todo. To avoid potential
overrides, use at least one period character (.) in custom tag names.
  [javadoc] 14 errors
  [javadoc] 100 warnings

BUILD FAILED
/srv/gump/public/workspace/ant/build.xml:1244: The following error occurred while executing
this line:
/srv/gump/public/workspace/ant/build.xml:1520: Javadoc returned 1

Total time: 25 seconds
---------------------------------------------

To subscribe to this information via syndicated feeds:
- RSS: http://vmgump-vm3.apache.org/ant/dist-ant/rss.xml
- Atom: http://vmgump-vm3.apache.org/ant/dist-ant/atom.xml

============================== Gump Tracking Only ===
Produced by Apache Gump(TM) version 2.3.
Gump Run 20190526000006, vmgump-vm3.apache.org:vmgump:20190526000006
Gump E-mail Identifier (unique within run) #14.

*********************************************************** G U M P
[GUMP@vmgump-vm3]: Project commons-bcel (in module apache-commons) failed
To whom it may engage...
        
This is an automated request, but not an unsolicited one. For 
more information please visit http://gump.apache.org/nagged.html, 
and/or contact the folk at general@gump.apache.org.

Project commons-bcel has an issue affecting its community integration,
 and has been outstanding for 2 runs.
The current state of this project is 'Failed', with reason 'Update Failed'.

Full details are available at:
    http://vmgump-vm3.apache.org/apache-commons/commons-bcel/index.html

That said, some information snippets are provided here.

The following annotations (debug/informational/warning/error messages) were provided:
 -DEBUG- Sole jar output [bcel-[0-9]*[0-9T].jar] identifier set to project name
 -INFO- Optional dependency commons-logging failed with reason update failed
 -INFO- Failed with reason update failed
 -INFO- Failed to extract fallback artifacts from Gump Repository

To subscribe to this information via syndicated feeds:
- RSS: http://vmgump-vm3.apache.org/apache-commons/commons-bcel/rss.xml
- Atom: http://vmgump-vm3.apache.org/apache-commons/commons-bcel/atom.xml

============================== Gump Tracking Only ===
Produced by Apache Gump(TM) version 2.3.
Gump Run 20190526000006, vmgump-vm3.apache.org:vmgump:20190526000006
Gump E-mail Identifier (unique within run) #15.

*********************************************************** G U M P
[GUMP@vmgump-vm3]: Project commons-exec (in module apache-commons) failed
To whom it may engage...
        
This is an automated request, but not an unsolicited one. For 
more information please visit http://gump.apache.org/nagged.html, 
and/or contact the folk at general@gump.apache.org.

Project commons-exec has an issue affecting its community integration,
 and has been outstanding for 2 runs.
The current state of this project is 'Failed', with reason 'Update Failed'.

Full details are available at:
    http://vmgump-vm3.apache.org/apache-commons/commons-exec/index.html

That said, some information snippets are provided here.

The following annotations (debug/informational/warning/error messages) were provided:
 -DEBUG- Sole jar output [commons-exec-*[0-9T].jar] identifier set to project name
 -INFO- Failed with reason update failed
 -INFO- Failed to extract fallback artifacts from Gump Repository

To subscribe to this information via syndicated feeds:
- RSS: http://vmgump-vm3.apache.org/apache-commons/commons-exec/rss.xml
- Atom: http://vmgump-vm3.apache.org/apache-commons/commons-exec/atom.xml

============================== Gump Tracking Only ===
Produced by Apache Gump(TM) version 2.3.
Gump Run 20190526000006, vmgump-vm3.apache.org:vmgump:20190526000006
Gump E-mail Identifier (unique within run) #16.


--
Apache Gump
http://gump.apache.org/ [Instance: vmgump-vm3]

---------------------------------------------------------------------
To unsubscribe, e-mail: general-unsubscribe@gump.apache.org
For additional commands, e-mail: general-help@gump.apache.org


Mime
View raw message