gump-general mailing list archives

Site index · List index
Message view « Date » · « Thread »
Top « Date » · « Thread »
From g...@gump-vm.apache.org
Subject BATCH: All dressed up, with nowhere to go...
Date Sun, 19 Jan 2020 01:21:59 GMT
Dear Gumpmeisters,
            
The following 12 notifys should have been sent

*********************************************************** G U M P
[GUMP@gump-vm]: Project logging-log4j-12 (in module logging-log4j-12) failed
[GUMP@gump-vm]: Project commons-lang (in module commons-lang-2.x) failed
[GUMP@gump-vm]: Project commons-io (in module commons-io) failed
[GUMP@gump-vm]: Project google-guava-parent (in module google-guava) failed
[GUMP@gump-vm]: Project commons-net (in module commons-net) failed
[GUMP@gump-vm]: Project google-guava (in module google-guava) failed
[GUMP@gump-vm]: Project commons-daemon (in module commons-daemon) failed
[GUMP@gump-vm]: Project easymock-parent (in module easymock) failed
[GUMP@gump-vm]: Project objenesis-parent (in module objenesis) failed
[GUMP@gump-vm]: Project commons-validator (in module commons-validator) failed
[GUMP@gump-vm]: Project commons-lang3 (in module commons-lang-trunk) failed
[GUMP@gump-vm]: Project commons-exec (in module commons-exec) failed
*********************************************************** G U M P
[GUMP@gump-vm]: Project logging-log4j-12 (in module logging-log4j-12) failed
To whom it may engage...
        
This is an automated request, but not an unsolicited one. For 
more information please visit http://gump.apache.org/nagged.html, 
and/or contact the folk at general@gump.apache.org.

Project logging-log4j-12 has an issue affecting its community integration.
This issue affects 11 projects,
 and has been outstanding for 10 runs.
The current state of this project is 'Failed', with reason 'Build Failed'.
For reference only, the following projects are affected by this:
    - checkstyle :  Java style checker
    - commons-beanutils :  Bean Utilities
    - commons-digester :  XML to Java Object Configuration
    - commons-logging :  Logging Library Package
    - commons-logging-step-1 :  Logging Library Package
    - jakarta-bsf :  Bean Scripting Framework
    - logging-log4j-12 :  Fast and flexible logging package for Java
    - logging-log4j-12-tests :  Fast and flexible logging package for Java
    - tomcat-tc7.0.x-validate :  Tomcat 7.x, a web server implementing Java Servlet 3.0,
    ...
    - tomcat-tc8.5.x-validate :  Tomcat 8.x, a web server implementing the Java Servlet 3.1,
...
    - tomcat-trunk-validate :  Tomcat 9.x, a web server implementing the Java Servlet 4.0,
...


Full details are available at:
    http://gump-vm.apache.org/logging-log4j-12/logging-log4j-12/index.html

That said, some information snippets are provided here.

The following annotations (debug/informational/warning/error messages) were provided:
 -DEBUG- (Apache Gump generated) Apache Maven Settings in: /srv/gump/public/workspace/logging-log4j-12/gump_mvn_settings.xml
 -INFO- Failed with reason build failed
 -DEBUG- Maven POM in: /srv/gump/public/workspace/logging-log4j-12/pom.xml
 -DEBUG- Extracted fallback artifacts from Gump Repository



The following work was performed:
http://gump-vm.apache.org/logging-log4j-12/logging-log4j-12/gump_work/build_logging-log4j-12_logging-log4j-12.html
Work Name: build_logging-log4j-12_logging-log4j-12 (Type: Build)
Work ended in a state of : Failed
Elapsed: 2 secs
Command Line: /opt/maven2/bin/mvn --batch-mode -DskipTests=true -Dmaven.javadoc.failOnError=false --settings /srv/gump/public/workspace/logging-log4j-12/gump_mvn_settings.xml package 
[Working Directory: /srv/gump/public/workspace/logging-log4j-12]
M2_HOME: /opt/maven2
---------------------------------------------
[INFO] Scanning for projects...
Downloading: http://localhost:8192/maven2/org/apache/felix/maven-bundle-plugin/2.1.0/maven-bundle-plugin-2.1.0.pom
[WARNING] Unable to get resource 'org.apache.felix:maven-bundle-plugin:pom:2.1.0' from repository central (http://repo1.maven.org/maven2): Error transferring file: Server returned HTTP response code: 501 for URL: http://localhost:8192/maven2/org/apache/felix/maven-bundle-plugin/2.1.0/maven-bundle-plugin-2.1.0.pom
Downloading: http://localhost:8192/maven/2/org/apache/felix/maven-bundle-plugin/2.1.0/maven-bundle-plugin-2.1.0.pom
0b downloaded  (maven-bundle-plugin-2.1.0.pom)
[WARNING] *** CHECKSUM FAILED - Invalid checksum file - RETRYING
Downloading: http://localhost:8192/maven/2/org/apache/felix/maven-bundle-plugin/2.1.0/maven-bundle-plugin-2.1.0.pom
0b downloaded  (maven-bundle-plugin-2.1.0.pom)
[WARNING] *** CHECKSUM FAILED - Invalid checksum file - IGNORING
[INFO] Unable to find resource 'org.apache.felix:maven-bundle-plugin:pom:2.1.0' in repository maven2-repository.dev.java.net (http://download.java.net/maven/2/)
Downloading: http://localhost:8192/maven2/org/apache/felix/maven-bundle-plugin/2.1.0/maven-bundle-plugin-2.1.0.pom
[WARNING] Unable to get resource 'org.apache.felix:maven-bundle-plugin:pom:2.1.0' from repository central (http://repo1.maven.org/maven2): Error transferring file: Server returned HTTP response code: 501 for URL: http://localhost:8192/maven2/org/apache/felix/maven-bundle-plugin/2.1.0/maven-bundle-plugin-2.1.0.pom
[INFO] ------------------------------------------------------------------------
[ERROR] BUILD ERROR
[INFO] ------------------------------------------------------------------------
[INFO] Error building POM (may not be this project's POM).


Project ID: org.apache.felix:maven-bundle-plugin

Reason: POM 'org.apache.felix:maven-bundle-plugin' not found in repository: Unable to download the artifact from any repository

  org.apache.felix:maven-bundle-plugin:pom:2.1.0

from the specified remote repositories:
  gump-maven2-repository.dev.java.net (http://localhost:8192/maven/2),
  gump-central (http://localhost:8192/maven2)

 for project org.apache.felix:maven-bundle-plugin


[INFO] ------------------------------------------------------------------------
[INFO] For more information, run Maven with the -e switch
[INFO] ------------------------------------------------------------------------
[INFO] Total time: 1 second
[INFO] Finished at: Sun Jan 19 00:01:21 UTC 2020
[INFO] Final Memory: 4M/75M
[INFO] ------------------------------------------------------------------------
---------------------------------------------

To subscribe to this information via syndicated feeds:
- RSS: http://gump-vm.apache.org/logging-log4j-12/logging-log4j-12/rss.xml
- Atom: http://gump-vm.apache.org/logging-log4j-12/logging-log4j-12/atom.xml

============================== Gump Tracking Only ===
Produced by Apache Gump(TM) version 2.3.
Gump Run 20200119000005, gump-vm.apache.org:vmgump:20200119000005
Gump E-mail Identifier (unique within run) #1.

*********************************************************** G U M P
[GUMP@gump-vm]: Project commons-lang (in module commons-lang-2.x) failed
To whom it may engage...
        
This is an automated request, but not an unsolicited one. For 
more information please visit http://gump.apache.org/nagged.html, 
and/or contact the folk at general@gump.apache.org.

Project commons-lang has an issue affecting its community integration.
This issue affects 1 projects,
 and has been outstanding for 10 runs.
The current state of this project is 'Failed', with reason 'Build Failed'.
For reference only, the following projects are affected by this:
    - commons-lang :  utilities for the classes that are in java.lang's hierarchy


Full details are available at:
    http://gump-vm.apache.org/commons-lang-2.x/commons-lang/index.html

That said, some information snippets are provided here.

The following annotations (debug/informational/warning/error messages) were provided:
 -DEBUG- (Apache Gump generated) Apache Maven Settings in: /srv/gump/public/workspace/commons-lang-2.x/gump_mvn_settings.xml
 -INFO- Failed with reason build failed
 -DEBUG- Maven POM in: /srv/gump/public/workspace/commons-lang-2.x/pom.xml
 -DEBUG- Extracted fallback artifacts from Gump Repository



The following work was performed:
http://gump-vm.apache.org/commons-lang-2.x/commons-lang/gump_work/build_commons-lang-2.x_commons-lang.html
Work Name: build_commons-lang-2.x_commons-lang (Type: Build)
Work ended in a state of : Failed
Elapsed: 1 sec
Command Line: /opt/maven2/bin/mvn --batch-mode -DskipTests=true --settings /srv/gump/public/workspace/commons-lang-2.x/gump_mvn_settings.xml package 
[Working Directory: /srv/gump/public/workspace/commons-lang-2.x]
M2_HOME: /opt/maven2
---------------------------------------------
	at org.apache.maven.cli.compat.CompatibleMain.main(CompatibleMain.java:60)
	at sun.reflect.NativeMethodAccessorImpl.invoke0(Native Method)
	at sun.reflect.NativeMethodAccessorImpl.invoke(NativeMethodAccessorImpl.java:62)
	at sun.reflect.DelegatingMethodAccessorImpl.invoke(DelegatingMethodAccessorImpl.java:43)
	at java.lang.reflect.Method.invoke(Method.java:498)
	at org.codehaus.classworlds.Launcher.launchEnhanced(Launcher.java:315)
	at org.codehaus.classworlds.Launcher.launch(Launcher.java:255)
	at org.codehaus.classworlds.Launcher.mainWithExitCode(Launcher.java:430)
	at org.codehaus.classworlds.Launcher.main(Launcher.java:375)
Caused by: org.apache.maven.project.ProjectBuildingException: Cannot find parent: org.apache.commons:commons-parent for project: commons-lang:commons-lang:jar:2.7-SNAPSHOT for project commons-lang:commons-lang:jar:2.7-SNAPSHOT
	at org.apache.maven.project.DefaultMavenProjectBuilder.assembleLineage(DefaultMavenProjectBuilder.java:1396)
	at org.apache.maven.project.DefaultMavenProjectBuilder.buildInternal(DefaultMavenProjectBuilder.java:823)
	at org.apache.maven.project.DefaultMavenProjectBuilder.buildFromSourceFileInternal(DefaultMavenProjectBuilder.java:508)
	at org.apache.maven.project.DefaultMavenProjectBuilder.build(DefaultMavenProjectBuilder.java:200)
	at org.apache.maven.DefaultMaven.getProject(DefaultMaven.java:604)
	at org.apache.maven.DefaultMaven.collectProjects(DefaultMaven.java:487)
	at org.apache.maven.DefaultMaven.getProjects(DefaultMaven.java:391)
	... 12 more
Caused by: org.apache.maven.project.ProjectBuildingException: POM 'org.apache.commons:commons-parent' not found in repository: Unable to download the artifact from any repository

  org.apache.commons:commons-parent:pom:17

from the specified remote repositories:
  gump-central (http://localhost:8192/maven2)

 for project org.apache.commons:commons-parent
	at org.apache.maven.project.DefaultMavenProjectBuilder.findModelFromRepository(DefaultMavenProjectBuilder.java:605)
	at org.apache.maven.project.DefaultMavenProjectBuilder.assembleLineage(DefaultMavenProjectBuilder.java:1392)
	... 18 more
Caused by: org.apache.maven.artifact.resolver.ArtifactNotFoundException: Unable to download the artifact from any repository

  org.apache.commons:commons-parent:pom:17

from the specified remote repositories:
  gump-central (http://localhost:8192/maven2)


	at org.apache.maven.artifact.resolver.DefaultArtifactResolver.resolve(DefaultArtifactResolver.java:228)
	at org.apache.maven.artifact.resolver.DefaultArtifactResolver.resolve(DefaultArtifactResolver.java:90)
	at org.apache.maven.project.DefaultMavenProjectBuilder.findModelFromRepository(DefaultMavenProjectBuilder.java:558)
	... 19 more
Caused by: org.apache.maven.wagon.ResourceDoesNotExistException: Unable to download the artifact from any repository
	at org.apache.maven.artifact.manager.DefaultWagonManager.getArtifact(DefaultWagonManager.java:404)
	at org.apache.maven.artifact.resolver.DefaultArtifactResolver.resolve(DefaultArtifactResolver.java:216)
	... 21 more
[INFO] ------------------------------------------------------------------------
[INFO] Total time: < 1 second
[INFO] Finished at: Sun Jan 19 00:01:25 UTC 2020
[INFO] Final Memory: 3M/75M
[INFO] ------------------------------------------------------------------------
---------------------------------------------

To subscribe to this information via syndicated feeds:
- RSS: http://gump-vm.apache.org/commons-lang-2.x/commons-lang/rss.xml
- Atom: http://gump-vm.apache.org/commons-lang-2.x/commons-lang/atom.xml

============================== Gump Tracking Only ===
Produced by Apache Gump(TM) version 2.3.
Gump Run 20200119000005, gump-vm.apache.org:vmgump:20200119000005
Gump E-mail Identifier (unique within run) #2.

*********************************************************** G U M P
[GUMP@gump-vm]: Project commons-io (in module commons-io) failed
To whom it may engage...
        
This is an automated request, but not an unsolicited one. For 
more information please visit http://gump.apache.org/nagged.html, 
and/or contact the folk at general@gump.apache.org.

Project commons-io has an issue affecting its community integration.
This issue affects 1 projects,
 and has been outstanding for 10 runs.
The current state of this project is 'Failed', with reason 'Build Failed'.
For reference only, the following projects are affected by this:
    - commons-io :  Commons I/O Utility Package


Full details are available at:
    http://gump-vm.apache.org/commons-io/commons-io/index.html

That said, some information snippets are provided here.

The following annotations (debug/informational/warning/error messages) were provided:
 -DEBUG- Sole jar output [commons-io-*[0-9T].jar] identifier set to project name
 -INFO- Optional dependency commons-lang failed with reason build failed
 -INFO- Optional dependency junit failed with reason build failed
 -DEBUG- (Apache Gump generated) Apache Maven Settings in: /srv/gump/public/workspace/commons-io/gump_mvn_settings.xml
 -INFO- Failed with reason build failed
 -DEBUG- Maven POM in: /srv/gump/public/workspace/commons-io/pom.xml
 -DEBUG- Extracted fallback artifacts from Gump Repository



The following work was performed:
http://gump-vm.apache.org/commons-io/commons-io/gump_work/build_commons-io_commons-io.html
Work Name: build_commons-io_commons-io (Type: Build)
Work ended in a state of : Failed
Elapsed: 4 secs
Command Line: /opt/maven3/bin/mvn --batch-mode -DskipTests=true --settings /srv/gump/public/workspace/commons-io/gump_mvn_settings.xml package 
[Working Directory: /srv/gump/public/workspace/commons-io]
M2_HOME: /opt/maven3
---------------------------------------------
[INFO] Scanning for projects...
[INFO] Downloading from gump-central: http://localhost:8192/maven2/org/apache/commons/commons-parent/50/commons-parent-50.pom
[ERROR] [ERROR] Some problems were encountered while processing the POMs:
[FATAL] Non-resolvable parent POM for commons-io:commons-io:2.7-SNAPSHOT: Could not transfer artifact org.apache.commons:commons-parent:pom:50 from/to gump-central (http://localhost:8192/maven2): Failed to transfer file http://localhost:8192/maven2/org/apache/commons/commons-parent/50/commons-parent-50.pom with status code 501 and 'parent.relativePath' points at wrong local POM @ line 19, column 11
 @ 
[ERROR] The build could not read 1 project -> [Help 1]
[ERROR]   
[ERROR]   The project commons-io:commons-io:2.7-SNAPSHOT (/srv/gump/public/workspace/commons-io/pom.xml) has 1 error
[ERROR]     Non-resolvable parent POM for commons-io:commons-io:2.7-SNAPSHOT: Could not transfer artifact org.apache.commons:commons-parent:pom:50 from/to gump-central (http://localhost:8192/maven2): Failed to transfer file http://localhost:8192/maven2/org/apache/commons/commons-parent/50/commons-parent-50.pom with status code 501 and 'parent.relativePath' points at wrong local POM @ line 19, column 11 -> [Help 2]
[ERROR] 
[ERROR] To see the full stack trace of the errors, re-run Maven with the -e switch.
[ERROR] Re-run Maven using the -X switch to enable full debug logging.
[ERROR] 
[ERROR] For more information about the errors and possible solutions, please read the following articles:
[ERROR] [Help 1] http://cwiki.apache.org/confluence/display/MAVEN/ProjectBuildingException
[ERROR] [Help 2] http://cwiki.apache.org/confluence/display/MAVEN/UnresolvableModelException
---------------------------------------------

To subscribe to this information via syndicated feeds:
- RSS: http://gump-vm.apache.org/commons-io/commons-io/rss.xml
- Atom: http://gump-vm.apache.org/commons-io/commons-io/atom.xml

============================== Gump Tracking Only ===
Produced by Apache Gump(TM) version 2.3.
Gump Run 20200119000005, gump-vm.apache.org:vmgump:20200119000005
Gump E-mail Identifier (unique within run) #4.

*********************************************************** G U M P
[GUMP@gump-vm]: Project google-guava-parent (in module google-guava) failed
To whom it may engage...
        
This is an automated request, but not an unsolicited one. For 
more information please visit http://gump.apache.org/nagged.html, 
and/or contact the folk at general@gump.apache.org.

Project google-guava-parent has an issue affecting its community integration.
This issue affects 1 projects,
 and has been outstanding for 10 runs.
The current state of this project is 'Failed', with reason 'Build Failed'.
For reference only, the following projects are affected by this:
    - google-guava-parent :  Guava is a suite of core and expanded libraries that include...


Full details are available at:
    http://gump-vm.apache.org/google-guava/google-guava-parent/index.html

That said, some information snippets are provided here.

The following annotations (debug/informational/warning/error messages) were provided:
 -INFO- Optional dependency junit failed with reason build failed
 -DEBUG- (Apache Gump generated) Apache Maven Settings in: /srv/gump/public/workspace/google-guava/gump_mvn_settings.xml
 -INFO- Failed with reason build failed
 -DEBUG- Maven POM in: /srv/gump/public/workspace/google-guava/pom.xml
 -INFO- Failed to extract fallback artifacts from Gump Repository



The following work was performed:
http://gump-vm.apache.org/google-guava/google-guava-parent/gump_work/build_google-guava_google-guava-parent.html
Work Name: build_google-guava_google-guava-parent (Type: Build)
Work ended in a state of : Failed
Elapsed: 4 secs
Command Line: /opt/maven3/bin/mvn --batch-mode -Dpackaging=pom -DgroupId=com.google.guava -Dfile=pom.xml -DartifactId=guava-parent -Dversion=HEAD-jre-SNAPSHOT --settings /srv/gump/public/workspace/google-guava/gump_mvn_settings.xml install:install-file 
[Working Directory: /srv/gump/public/workspace/google-guava]
M2_HOME: /opt/maven3
---------------------------------------------
[INFO] Scanning for projects...
[INFO] Downloading from gump-central: http://localhost:8192/maven2/org/sonatype/oss/oss-parent/9/oss-parent-9.pom
[INFO] Downloading from gump-central: http://localhost:8192/maven2/org/apache/felix/maven-bundle-plugin/2.5.0/maven-bundle-plugin-2.5.0.pom
[ERROR] [ERROR] Some problems were encountered while processing the POMs:
[WARNING] 'parent.relativePath' of POM com.google.guava:guava-bom:HEAD-jre-SNAPSHOT (/srv/gump/public/workspace/google-guava/guava-bom/pom.xml) points at com.google.guava:guava-parent instead of org.sonatype.oss:oss-parent, please verify your project structure @ line 14, column 11
[FATAL] Non-resolvable parent POM for com.google.guava:guava-bom:HEAD-jre-SNAPSHOT: Could not transfer artifact org.sonatype.oss:oss-parent:pom:9 from/to gump-central (http://localhost:8192/maven2): Failed to transfer file http://localhost:8192/maven2/org/sonatype/oss/oss-parent/9/oss-parent-9.pom with status code 501 and 'parent.relativePath' points at wrong local POM @ line 14, column 11
[ERROR] Unresolveable build extension: Plugin org.apache.felix:maven-bundle-plugin:2.5.0 or one of its dependencies could not be resolved: Failed to read artifact descriptor for org.apache.felix:maven-bundle-plugin:jar:2.5.0 @ 
[ERROR] Unknown packaging: bundle @ line 11, column 14
 @ 
[ERROR] The build could not read 2 projects -> [Help 1]
[ERROR]   
[ERROR]   The project com.google.guava:guava-bom:HEAD-jre-SNAPSHOT (/srv/gump/public/workspace/google-guava/guava-bom/pom.xml) has 1 error
[ERROR]     Non-resolvable parent POM for com.google.guava:guava-bom:HEAD-jre-SNAPSHOT: Could not transfer artifact org.sonatype.oss:oss-parent:pom:9 from/to gump-central (http://localhost:8192/maven2): Failed to transfer file http://localhost:8192/maven2/org/sonatype/oss/oss-parent/9/oss-parent-9.pom with status code 501 and 'parent.relativePath' points at wrong local POM @ line 14, column 11 -> [Help 2]
[ERROR]   
[ERROR]   The project com.google.guava:guava:HEAD-jre-SNAPSHOT (/srv/gump/public/workspace/google-guava/guava/pom.xml) has 2 errors
[ERROR]     Unresolveable build extension: Plugin org.apache.felix:maven-bundle-plugin:2.5.0 or one of its dependencies could not be resolved: Failed to read artifact descriptor for org.apache.felix:maven-bundle-plugin:jar:2.5.0: Could not transfer artifact org.apache.felix:maven-bundle-plugin:pom:2.5.0 from/to gump-central (http://localhost:8192/maven2): Failed to transfer file http://localhost:8192/maven2/org/apache/felix/maven-bundle-plugin/2.5.0/maven-bundle-plugin-2.5.0.pom with status code 501 -> [Help 3]
[ERROR]     Unknown packaging: bundle @ line 11, column 14
[ERROR] 
[ERROR] To see the full stack trace of the errors, re-run Maven with the -e switch.
[ERROR] Re-run Maven using the -X switch to enable full debug logging.
[ERROR] 
[ERROR] For more information about the errors and possible solutions, please read the following articles:
[ERROR] [Help 1] http://cwiki.apache.org/confluence/display/MAVEN/ProjectBuildingException
[ERROR] [Help 2] http://cwiki.apache.org/confluence/display/MAVEN/UnresolvableModelException
[ERROR] [Help 3] http://cwiki.apache.org/confluence/display/MAVEN/PluginManagerException
---------------------------------------------

To subscribe to this information via syndicated feeds:
- RSS: http://gump-vm.apache.org/google-guava/google-guava-parent/rss.xml
- Atom: http://gump-vm.apache.org/google-guava/google-guava-parent/atom.xml

============================== Gump Tracking Only ===
Produced by Apache Gump(TM) version 2.3.
Gump Run 20200119000005, gump-vm.apache.org:vmgump:20200119000005
Gump E-mail Identifier (unique within run) #5.

*********************************************************** G U M P
[GUMP@gump-vm]: Project commons-net (in module commons-net) failed
To whom it may engage...
        
This is an automated request, but not an unsolicited one. For 
more information please visit http://gump.apache.org/nagged.html, 
and/or contact the folk at general@gump.apache.org.

Project commons-net has an issue affecting its community integration.
This issue affects 1 projects,
 and has been outstanding for 10 runs.
The current state of this project is 'Failed', with reason 'Build Failed'.
For reference only, the following projects are affected by this:
    - commons-net :  Commons Net


Full details are available at:
    http://gump-vm.apache.org/commons-net/commons-net/index.html

That said, some information snippets are provided here.

The following annotations (debug/informational/warning/error messages) were provided:
 -INFO- Optional dependency junit failed with reason build failed
 -DEBUG- (Apache Gump generated) Apache Maven Settings in: /srv/gump/public/workspace/commons-net/gump_mvn_settings.xml
 -INFO- Failed with reason build failed
 -DEBUG- Maven POM in: /srv/gump/public/workspace/commons-net/pom.xml
 -DEBUG- Extracted fallback artifacts from Gump Repository



The following work was performed:
http://gump-vm.apache.org/commons-net/commons-net/gump_work/build_commons-net_commons-net.html
Work Name: build_commons-net_commons-net (Type: Build)
Work ended in a state of : Failed
Elapsed: 4 secs
Command Line: /opt/maven3/bin/mvn --batch-mode -DskipTests=true --settings /srv/gump/public/workspace/commons-net/gump_mvn_settings.xml package 
[Working Directory: /srv/gump/public/workspace/commons-net]
M2_HOME: /opt/maven3
---------------------------------------------
[INFO] Scanning for projects...
[INFO] Downloading from gump-central: http://localhost:8192/maven2/org/apache/commons/commons-parent/43/commons-parent-43.pom
[ERROR] [ERROR] Some problems were encountered while processing the POMs:
[FATAL] Non-resolvable parent POM for commons-net:commons-net:3.7-SNAPSHOT: Could not transfer artifact org.apache.commons:commons-parent:pom:43 from/to gump-central (http://localhost:8192/maven2): Failed to transfer file http://localhost:8192/maven2/org/apache/commons/commons-parent/43/commons-parent-43.pom with status code 501 and 'parent.relativePath' points at wrong local POM @ line 23, column 13
 @ 
[ERROR] The build could not read 1 project -> [Help 1]
[ERROR]   
[ERROR]   The project commons-net:commons-net:3.7-SNAPSHOT (/srv/gump/public/workspace/commons-net/pom.xml) has 1 error
[ERROR]     Non-resolvable parent POM for commons-net:commons-net:3.7-SNAPSHOT: Could not transfer artifact org.apache.commons:commons-parent:pom:43 from/to gump-central (http://localhost:8192/maven2): Failed to transfer file http://localhost:8192/maven2/org/apache/commons/commons-parent/43/commons-parent-43.pom with status code 501 and 'parent.relativePath' points at wrong local POM @ line 23, column 13 -> [Help 2]
[ERROR] 
[ERROR] To see the full stack trace of the errors, re-run Maven with the -e switch.
[ERROR] Re-run Maven using the -X switch to enable full debug logging.
[ERROR] 
[ERROR] For more information about the errors and possible solutions, please read the following articles:
[ERROR] [Help 1] http://cwiki.apache.org/confluence/display/MAVEN/ProjectBuildingException
[ERROR] [Help 2] http://cwiki.apache.org/confluence/display/MAVEN/UnresolvableModelException
---------------------------------------------

To subscribe to this information via syndicated feeds:
- RSS: http://gump-vm.apache.org/commons-net/commons-net/rss.xml
- Atom: http://gump-vm.apache.org/commons-net/commons-net/atom.xml

============================== Gump Tracking Only ===
Produced by Apache Gump(TM) version 2.3.
Gump Run 20200119000005, gump-vm.apache.org:vmgump:20200119000005
Gump E-mail Identifier (unique within run) #6.

*********************************************************** G U M P
[GUMP@gump-vm]: Project google-guava (in module google-guava) failed
To whom it may engage...
        
This is an automated request, but not an unsolicited one. For 
more information please visit http://gump.apache.org/nagged.html, 
and/or contact the folk at general@gump.apache.org.

Project google-guava has an issue affecting its community integration.
This issue affects 1 projects,
 and has been outstanding for 10 runs.
The current state of this project is 'Failed', with reason 'Build Failed'.
For reference only, the following projects are affected by this:
    - google-guava :  Guava is a suite of core and expanded libraries that include...


Full details are available at:
    http://gump-vm.apache.org/google-guava/google-guava/index.html

That said, some information snippets are provided here.

The following annotations (debug/informational/warning/error messages) were provided:
 -INFO- Optional dependency google-guava-parent failed with reason build failed
 -DEBUG- (Apache Gump generated) Apache Maven Settings in: /srv/gump/public/workspace/google-guava/guava/gump_mvn_settings.xml
 -INFO- Failed with reason build failed
 -DEBUG- Maven POM in: /srv/gump/public/workspace/google-guava/guava/pom.xml
 -INFO- Failed to extract fallback artifacts from Gump Repository



The following work was performed:
http://gump-vm.apache.org/google-guava/google-guava/gump_work/build_google-guava_google-guava.html
Work Name: build_google-guava_google-guava (Type: Build)
Work ended in a state of : Failed
Elapsed: 4 secs
Command Line: /opt/maven3/bin/mvn --batch-mode --settings /srv/gump/public/workspace/google-guava/guava/gump_mvn_settings.xml package 
[Working Directory: /srv/gump/public/workspace/google-guava/guava]
M2_HOME: /opt/maven3
---------------------------------------------
[INFO] Scanning for projects...
[INFO] Downloading from gump-central: http://localhost:8192/maven2/org/apache/felix/maven-bundle-plugin/2.5.0/maven-bundle-plugin-2.5.0.pom
[ERROR] [ERROR] Some problems were encountered while processing the POMs:
[ERROR] Unresolveable build extension: Plugin org.apache.felix:maven-bundle-plugin:2.5.0 or one of its dependencies could not be resolved: Failed to read artifact descriptor for org.apache.felix:maven-bundle-plugin:jar:2.5.0 @ 
[ERROR] Unknown packaging: bundle @ line 11, column 14
 @ 
[ERROR] The build could not read 1 project -> [Help 1]
[ERROR]   
[ERROR]   The project com.google.guava:guava:HEAD-jre-SNAPSHOT (/srv/gump/public/workspace/google-guava/guava/pom.xml) has 2 errors
[ERROR]     Unresolveable build extension: Plugin org.apache.felix:maven-bundle-plugin:2.5.0 or one of its dependencies could not be resolved: Failed to read artifact descriptor for org.apache.felix:maven-bundle-plugin:jar:2.5.0: Could not transfer artifact org.apache.felix:maven-bundle-plugin:pom:2.5.0 from/to gump-central (http://localhost:8192/maven2): Failed to transfer file http://localhost:8192/maven2/org/apache/felix/maven-bundle-plugin/2.5.0/maven-bundle-plugin-2.5.0.pom with status code 501 -> [Help 2]
[ERROR]     Unknown packaging: bundle @ line 11, column 14
[ERROR] 
[ERROR] To see the full stack trace of the errors, re-run Maven with the -e switch.
[ERROR] Re-run Maven using the -X switch to enable full debug logging.
[ERROR] 
[ERROR] For more information about the errors and possible solutions, please read the following articles:
[ERROR] [Help 1] http://cwiki.apache.org/confluence/display/MAVEN/ProjectBuildingException
[ERROR] [Help 2] http://cwiki.apache.org/confluence/display/MAVEN/PluginManagerException
---------------------------------------------

To subscribe to this information via syndicated feeds:
- RSS: http://gump-vm.apache.org/google-guava/google-guava/rss.xml
- Atom: http://gump-vm.apache.org/google-guava/google-guava/atom.xml

============================== Gump Tracking Only ===
Produced by Apache Gump(TM) version 2.3.
Gump Run 20200119000005, gump-vm.apache.org:vmgump:20200119000005
Gump E-mail Identifier (unique within run) #8.

*********************************************************** G U M P
[GUMP@gump-vm]: Project commons-daemon (in module commons-daemon) failed
To whom it may engage...
        
This is an automated request, but not an unsolicited one. For 
more information please visit http://gump.apache.org/nagged.html, 
and/or contact the folk at general@gump.apache.org.

Project commons-daemon has an issue affecting its community integration.
This issue affects 1 projects,
 and has been outstanding for 10 runs.
The current state of this project is 'Failed', with reason 'Build Failed'.
For reference only, the following projects are affected by this:
    - commons-daemon :  Commons Daemon


Full details are available at:
    http://gump-vm.apache.org/commons-daemon/commons-daemon/index.html

That said, some information snippets are provided here.

The following annotations (debug/informational/warning/error messages) were provided:
 -INFO- Optional dependency ant prerequisite failed with reason build failed
 -DEBUG- (Apache Gump generated) Apache Maven Settings in: /srv/gump/public/workspace/commons-daemon/gump_mvn_settings.xml
 -INFO- Failed with reason build failed
 -DEBUG- Maven POM in: /srv/gump/public/workspace/commons-daemon/pom.xml
 -DEBUG- Extracted fallback artifacts from Gump Repository



The following work was performed:
http://gump-vm.apache.org/commons-daemon/commons-daemon/gump_work/build_commons-daemon_commons-daemon.html
Work Name: build_commons-daemon_commons-daemon (Type: Build)
Work ended in a state of : Failed
Elapsed: 4 secs
Command Line: /opt/maven3/bin/mvn --batch-mode --settings /srv/gump/public/workspace/commons-daemon/gump_mvn_settings.xml package 
[Working Directory: /srv/gump/public/workspace/commons-daemon]
M2_HOME: /opt/maven3
---------------------------------------------
[INFO] Scanning for projects...
[INFO] Downloading from gump-central: http://localhost:8192/maven2/org/apache/commons/commons-parent/49/commons-parent-49.pom
[ERROR] [ERROR] Some problems were encountered while processing the POMs:
[FATAL] Non-resolvable parent POM for commons-daemon:commons-daemon:1.2.3-SNAPSHOT: Could not transfer artifact org.apache.commons:commons-parent:pom:49 from/to gump-central (http://localhost:8192/maven2): Failed to transfer file http://localhost:8192/maven2/org/apache/commons/commons-parent/49/commons-parent-49.pom with status code 501 and 'parent.relativePath' points at wrong local POM @ line 22, column 11
 @ 
[ERROR] The build could not read 1 project -> [Help 1]
[ERROR]   
[ERROR]   The project commons-daemon:commons-daemon:1.2.3-SNAPSHOT (/srv/gump/public/workspace/commons-daemon/pom.xml) has 1 error
[ERROR]     Non-resolvable parent POM for commons-daemon:commons-daemon:1.2.3-SNAPSHOT: Could not transfer artifact org.apache.commons:commons-parent:pom:49 from/to gump-central (http://localhost:8192/maven2): Failed to transfer file http://localhost:8192/maven2/org/apache/commons/commons-parent/49/commons-parent-49.pom with status code 501 and 'parent.relativePath' points at wrong local POM @ line 22, column 11 -> [Help 2]
[ERROR] 
[ERROR] To see the full stack trace of the errors, re-run Maven with the -e switch.
[ERROR] Re-run Maven using the -X switch to enable full debug logging.
[ERROR] 
[ERROR] For more information about the errors and possible solutions, please read the following articles:
[ERROR] [Help 1] http://cwiki.apache.org/confluence/display/MAVEN/ProjectBuildingException
[ERROR] [Help 2] http://cwiki.apache.org/confluence/display/MAVEN/UnresolvableModelException
---------------------------------------------

To subscribe to this information via syndicated feeds:
- RSS: http://gump-vm.apache.org/commons-daemon/commons-daemon/rss.xml
- Atom: http://gump-vm.apache.org/commons-daemon/commons-daemon/atom.xml

============================== Gump Tracking Only ===
Produced by Apache Gump(TM) version 2.3.
Gump Run 20200119000005, gump-vm.apache.org:vmgump:20200119000005
Gump E-mail Identifier (unique within run) #9.

*********************************************************** G U M P
[GUMP@gump-vm]: Project easymock-parent (in module easymock) failed
To whom it may engage...
        
This is an automated request, but not an unsolicited one. For 
more information please visit http://gump.apache.org/nagged.html, 
and/or contact the folk at general@gump.apache.org.

Project easymock-parent has an issue affecting its community integration.
This issue affects 2 projects,
 and has been outstanding for 10 runs.
The current state of this project is 'Failed', with reason 'Build Failed'.
For reference only, the following projects are affected by this:
    - easymock :  EasyMock is a Java library that provides an easy way to use ...
    - easymock-parent :  EasyMock is a Java library that provides an easy way to use ...


Full details are available at:
    http://gump-vm.apache.org/easymock/easymock-parent/index.html

That said, some information snippets are provided here.

The following annotations (debug/informational/warning/error messages) were provided:
 -INFO- Optional dependency commons-codec prerequisite failed with reason build failed
 -INFO- Optional dependency junit failed with reason build failed
 -DEBUG- (Apache Gump generated) Apache Maven Settings in: /srv/gump/public/workspace/easymock/gump_mvn_settings.xml
 -INFO- Failed with reason build failed
 -DEBUG- Maven POM in: /srv/gump/public/workspace/easymock/pom.xml
 -INFO- Failed to extract fallback artifacts from Gump Repository



The following work was performed:
http://gump-vm.apache.org/easymock/easymock-parent/gump_work/build_easymock_easymock-parent.html
Work Name: build_easymock_easymock-parent (Type: Build)
Work ended in a state of : Failed
Elapsed: 4 secs
Command Line: /opt/maven3/bin/mvn --batch-mode -Dpackaging=pom -DgroupId=org.easymock -Dfile=pom.xml -DartifactId=easymock-parent -Dversion=4.2-SNAPSHOT --settings /srv/gump/public/workspace/easymock/gump_mvn_settings.xml install:install-file 
[Working Directory: /srv/gump/public/workspace/easymock]
M2_HOME: /opt/maven3
---------------------------------------------
[INFO] Scanning for projects...
[INFO] Downloading from gump-central: http://localhost:8192/maven2/org/apache/maven/wagon/wagon-ssh-external/1.0-beta-6/wagon-ssh-external-1.0-beta-6.pom
[ERROR] [ERROR] Some problems were encountered while processing the POMs:
[ERROR] Unresolveable build extension: Plugin org.apache.maven.wagon:wagon-ssh-external:1.0-beta-6 or one of its dependencies could not be resolved: Failed to read artifact descriptor for org.apache.maven.wagon:wagon-ssh-external:jar:1.0-beta-6 @ 
 @ 
[ERROR] The build could not read 1 project -> [Help 1]
[ERROR]   
[ERROR]   The project org.easymock:easymock-parent:4.2-SNAPSHOT (/srv/gump/public/workspace/easymock/pom.xml) has 1 error
[ERROR]     Unresolveable build extension: Plugin org.apache.maven.wagon:wagon-ssh-external:1.0-beta-6 or one of its dependencies could not be resolved: Failed to read artifact descriptor for org.apache.maven.wagon:wagon-ssh-external:jar:1.0-beta-6: Could not transfer artifact org.apache.maven.wagon:wagon-ssh-external:pom:1.0-beta-6 from/to gump-central (http://localhost:8192/maven2): Failed to transfer file http://localhost:8192/maven2/org/apache/maven/wagon/wagon-ssh-external/1.0-beta-6/wagon-ssh-external-1.0-beta-6.pom with status code 501 -> [Help 2]
[ERROR] 
[ERROR] To see the full stack trace of the errors, re-run Maven with the -e switch.
[ERROR] Re-run Maven using the -X switch to enable full debug logging.
[ERROR] 
[ERROR] For more information about the errors and possible solutions, please read the following articles:
[ERROR] [Help 1] http://cwiki.apache.org/confluence/display/MAVEN/ProjectBuildingException
[ERROR] [Help 2] http://cwiki.apache.org/confluence/display/MAVEN/PluginManagerException
---------------------------------------------

To subscribe to this information via syndicated feeds:
- RSS: http://gump-vm.apache.org/easymock/easymock-parent/rss.xml
- Atom: http://gump-vm.apache.org/easymock/easymock-parent/atom.xml

============================== Gump Tracking Only ===
Produced by Apache Gump(TM) version 2.3.
Gump Run 20200119000005, gump-vm.apache.org:vmgump:20200119000005
Gump E-mail Identifier (unique within run) #10.

*********************************************************** G U M P
[GUMP@gump-vm]: Project objenesis-parent (in module objenesis) failed
To whom it may engage...
        
This is an automated request, but not an unsolicited one. For 
more information please visit http://gump.apache.org/nagged.html, 
and/or contact the folk at general@gump.apache.org.

Project objenesis-parent has an issue affecting its community integration.
This issue affects 2 projects,
 and has been outstanding for 10 runs.
The current state of this project is 'Failed', with reason 'Build Failed'.
For reference only, the following projects are affected by this:
    - objenesis :  Objenesis is a small Java library that serves one purpose: T...
    - objenesis-parent :  Objenesis is a small Java library that serves one purpose: T...


Full details are available at:
    http://gump-vm.apache.org/objenesis/objenesis-parent/index.html

That said, some information snippets are provided here.

The following annotations (debug/informational/warning/error messages) were provided:
 -INFO- Optional dependency commons-cli prerequisite failed with reason build failed
 -INFO- Optional dependency junit failed with reason build failed
 -DEBUG- (Apache Gump generated) Apache Maven Settings in: /srv/gump/public/workspace/objenesis/gump_mvn_settings.xml
 -INFO- Failed with reason build failed
 -DEBUG- Maven POM in: /srv/gump/public/workspace/objenesis/pom.xml
 -DEBUG- Extracted fallback artifacts from Gump Repository



The following work was performed:
http://gump-vm.apache.org/objenesis/objenesis-parent/gump_work/build_objenesis_objenesis-parent.html
Work Name: build_objenesis_objenesis-parent (Type: Build)
Work ended in a state of : Failed
Elapsed: 5 secs
Command Line: /opt/maven3/bin/mvn --batch-mode -Dpackaging=pom -DgroupId=org.objenesis -Dfile=pom.xml -DartifactId=objenesis-parent -Dversion=3.2-SNAPSHOT --settings /srv/gump/public/workspace/objenesis/gump_mvn_settings.xml install:install-file 
[Working Directory: /srv/gump/public/workspace/objenesis]
M2_HOME: /opt/maven3
---------------------------------------------
[INFO] Scanning for projects...
[INFO] Downloading from gump-central: http://localhost:8192/maven2/org/apache/maven/wagon/wagon-ssh-external/2.10/wagon-ssh-external-2.10.pom
[ERROR] [ERROR] Some problems were encountered while processing the POMs:
[ERROR] Unresolveable build extension: Plugin org.apache.maven.wagon:wagon-ssh-external:2.10 or one of its dependencies could not be resolved: Failed to read artifact descriptor for org.apache.maven.wagon:wagon-ssh-external:jar:2.10 @ 
 @ 
[ERROR] The build could not read 1 project -> [Help 1]
[ERROR]   
[ERROR]   The project org.objenesis:objenesis-parent:3.2-SNAPSHOT (/srv/gump/public/workspace/objenesis/pom.xml) has 1 error
[ERROR]     Unresolveable build extension: Plugin org.apache.maven.wagon:wagon-ssh-external:2.10 or one of its dependencies could not be resolved: Failed to read artifact descriptor for org.apache.maven.wagon:wagon-ssh-external:jar:2.10: Could not transfer artifact org.apache.maven.wagon:wagon-ssh-external:pom:2.10 from/to gump-central (http://localhost:8192/maven2): Failed to transfer file http://localhost:8192/maven2/org/apache/maven/wagon/wagon-ssh-external/2.10/wagon-ssh-external-2.10.pom with status code 501 -> [Help 2]
[ERROR] 
[ERROR] To see the full stack trace of the errors, re-run Maven with the -e switch.
[ERROR] Re-run Maven using the -X switch to enable full debug logging.
[ERROR] 
[ERROR] For more information about the errors and possible solutions, please read the following articles:
[ERROR] [Help 1] http://cwiki.apache.org/confluence/display/MAVEN/ProjectBuildingException
[ERROR] [Help 2] http://cwiki.apache.org/confluence/display/MAVEN/PluginManagerException
---------------------------------------------

To subscribe to this information via syndicated feeds:
- RSS: http://gump-vm.apache.org/objenesis/objenesis-parent/rss.xml
- Atom: http://gump-vm.apache.org/objenesis/objenesis-parent/atom.xml

============================== Gump Tracking Only ===
Produced by Apache Gump(TM) version 2.3.
Gump Run 20200119000005, gump-vm.apache.org:vmgump:20200119000005
Gump E-mail Identifier (unique within run) #11.

*********************************************************** G U M P
[GUMP@gump-vm]: Project commons-validator (in module commons-validator) failed
To whom it may engage...
        
This is an automated request, but not an unsolicited one. For 
more information please visit http://gump.apache.org/nagged.html, 
and/or contact the folk at general@gump.apache.org.

Project commons-validator has an issue affecting its community integration.
This issue affects 1 projects,
 and has been outstanding for 10 runs.
The current state of this project is 'Failed', with reason 'Build Failed'.
For reference only, the following projects are affected by this:
    - commons-validator :  Validation Framework


Full details are available at:
    http://gump-vm.apache.org/commons-validator/commons-validator/index.html

That said, some information snippets are provided here.

The following annotations (debug/informational/warning/error messages) were provided:
 -DEBUG- Sole jar output [commons-validator-*[0-9T].jar] identifier set to project name
 -INFO- Optional dependency commons-digester prerequisite failed with reason build failed
 -INFO- Optional dependency commons-beanutils prerequisite failed with reason build failed
 -INFO- Optional dependency commons-logging prerequisite failed with reason build failed
 -INFO- Optional dependency junit failed with reason build failed
 -DEBUG- (Apache Gump generated) Apache Maven Settings in: /srv/gump/public/workspace/commons-validator/gump_mvn_settings.xml
 -INFO- Failed with reason build failed
 -DEBUG- Maven POM in: /srv/gump/public/workspace/commons-validator/pom.xml
 -DEBUG- Extracted fallback artifacts from Gump Repository



The following work was performed:
http://gump-vm.apache.org/commons-validator/commons-validator/gump_work/build_commons-validator_commons-validator.html
Work Name: build_commons-validator_commons-validator (Type: Build)
Work ended in a state of : Failed
Elapsed: 6 secs
Command Line: /opt/maven3/bin/mvn --batch-mode -DskipTests=true --settings /srv/gump/public/workspace/commons-validator/gump_mvn_settings.xml package 
[Working Directory: /srv/gump/public/workspace/commons-validator]
M2_HOME: /opt/maven3
---------------------------------------------
[INFO] Scanning for projects...
[INFO] Downloading from gump-central: http://localhost:8192/maven2/org/apache/commons/commons-parent/49/commons-parent-49.pom
[ERROR] [ERROR] Some problems were encountered while processing the POMs:
[FATAL] Non-resolvable parent POM for commons-validator:commons-validator:1.7-SNAPSHOT: Could not transfer artifact org.apache.commons:commons-parent:pom:49 from/to gump-central (http://localhost:8192/maven2): Failed to transfer file http://localhost:8192/maven2/org/apache/commons/commons-parent/49/commons-parent-49.pom with status code 501 and 'parent.relativePath' points at wrong local POM @ line 22, column 11
 @ 
[ERROR] The build could not read 1 project -> [Help 1]
[ERROR]   
[ERROR]   The project commons-validator:commons-validator:1.7-SNAPSHOT (/srv/gump/public/workspace/commons-validator/pom.xml) has 1 error
[ERROR]     Non-resolvable parent POM for commons-validator:commons-validator:1.7-SNAPSHOT: Could not transfer artifact org.apache.commons:commons-parent:pom:49 from/to gump-central (http://localhost:8192/maven2): Failed to transfer file http://localhost:8192/maven2/org/apache/commons/commons-parent/49/commons-parent-49.pom with status code 501 and 'parent.relativePath' points at wrong local POM @ line 22, column 11 -> [Help 2]
[ERROR] 
[ERROR] To see the full stack trace of the errors, re-run Maven with the -e switch.
[ERROR] Re-run Maven using the -X switch to enable full debug logging.
[ERROR] 
[ERROR] For more information about the errors and possible solutions, please read the following articles:
[ERROR] [Help 1] http://cwiki.apache.org/confluence/display/MAVEN/ProjectBuildingException
[ERROR] [Help 2] http://cwiki.apache.org/confluence/display/MAVEN/UnresolvableModelException
---------------------------------------------

To subscribe to this information via syndicated feeds:
- RSS: http://gump-vm.apache.org/commons-validator/commons-validator/rss.xml
- Atom: http://gump-vm.apache.org/commons-validator/commons-validator/atom.xml

============================== Gump Tracking Only ===
Produced by Apache Gump(TM) version 2.3.
Gump Run 20200119000005, gump-vm.apache.org:vmgump:20200119000005
Gump E-mail Identifier (unique within run) #12.

*********************************************************** G U M P
[GUMP@gump-vm]: Project commons-lang3 (in module commons-lang-trunk) failed
To whom it may engage...
        
This is an automated request, but not an unsolicited one. For 
more information please visit http://gump.apache.org/nagged.html, 
and/or contact the folk at general@gump.apache.org.

Project commons-lang3 has an issue affecting its community integration.
This issue affects 1 projects,
 and has been outstanding for 10 runs.
The current state of this project is 'Failed', with reason 'Build Failed'.
For reference only, the following projects are affected by this:
    - commons-lang3 :  utilities for the classes that are in java.lang's hierarchy


Full details are available at:
    http://gump-vm.apache.org/commons-lang-trunk/commons-lang3/index.html

That said, some information snippets are provided here.

The following annotations (debug/informational/warning/error messages) were provided:
 -DEBUG- Sole jar output [commons-lang3-*[0-9T].jar] identifier set to project name
 -DEBUG- Sole pom output [pom.xml] identifier set to project name
 -INFO- Optional dependency org.apache.ant prerequisite failed with reason build failed
 -INFO- Optional dependency junit failed with reason build failed
 -INFO- Optional dependency commons-io failed with reason build failed
 -INFO- Optional dependency easymock prerequisite failed with reason build failed
 -DEBUG- (Apache Gump generated) Apache Maven Settings in: /srv/gump/public/workspace/commons-lang-trunk/gump_mvn_settings.xml
 -INFO- Failed with reason build failed
 -DEBUG- Maven POM in: /srv/gump/public/workspace/commons-lang-trunk/pom.xml
 -DEBUG- Extracted fallback artifacts from Gump Repository



The following work was performed:
http://gump-vm.apache.org/commons-lang-trunk/commons-lang3/gump_work/build_commons-lang-trunk_commons-lang3.html
Work Name: build_commons-lang-trunk_commons-lang3 (Type: Build)
Work ended in a state of : Failed
Elapsed: 6 secs
Command Line: /opt/maven3/bin/mvn --batch-mode -DskipTests=true --settings /srv/gump/public/workspace/commons-lang-trunk/gump_mvn_settings.xml package 
[Working Directory: /srv/gump/public/workspace/commons-lang-trunk]
M2_HOME: /opt/maven3
---------------------------------------------
[INFO] Scanning for projects...
[INFO] Downloading from gump-central: http://localhost:8192/maven2/org/apache/commons/commons-parent/50/commons-parent-50.pom
[ERROR] [ERROR] Some problems were encountered while processing the POMs:
[FATAL] Non-resolvable parent POM for org.apache.commons:commons-lang3:3.10-SNAPSHOT: Could not transfer artifact org.apache.commons:commons-parent:pom:50 from/to gump-central (http://localhost:8192/maven2): Failed to transfer file http://localhost:8192/maven2/org/apache/commons/commons-parent/50/commons-parent-50.pom with status code 501 and 'parent.relativePath' points at wrong local POM @ line 22, column 11
 @ 
[ERROR] The build could not read 1 project -> [Help 1]
[ERROR]   
[ERROR]   The project org.apache.commons:commons-lang3:3.10-SNAPSHOT (/srv/gump/public/workspace/commons-lang-trunk/pom.xml) has 1 error
[ERROR]     Non-resolvable parent POM for org.apache.commons:commons-lang3:3.10-SNAPSHOT: Could not transfer artifact org.apache.commons:commons-parent:pom:50 from/to gump-central (http://localhost:8192/maven2): Failed to transfer file http://localhost:8192/maven2/org/apache/commons/commons-parent/50/commons-parent-50.pom with status code 501 and 'parent.relativePath' points at wrong local POM @ line 22, column 11 -> [Help 2]
[ERROR] 
[ERROR] To see the full stack trace of the errors, re-run Maven with the -e switch.
[ERROR] Re-run Maven using the -X switch to enable full debug logging.
[ERROR] 
[ERROR] For more information about the errors and possible solutions, please read the following articles:
[ERROR] [Help 1] http://cwiki.apache.org/confluence/display/MAVEN/ProjectBuildingException
[ERROR] [Help 2] http://cwiki.apache.org/confluence/display/MAVEN/UnresolvableModelException
---------------------------------------------

To subscribe to this information via syndicated feeds:
- RSS: http://gump-vm.apache.org/commons-lang-trunk/commons-lang3/rss.xml
- Atom: http://gump-vm.apache.org/commons-lang-trunk/commons-lang3/atom.xml

============================== Gump Tracking Only ===
Produced by Apache Gump(TM) version 2.3.
Gump Run 20200119000005, gump-vm.apache.org:vmgump:20200119000005
Gump E-mail Identifier (unique within run) #13.

*********************************************************** G U M P
[GUMP@gump-vm]: Project commons-exec (in module commons-exec) failed
To whom it may engage...
        
This is an automated request, but not an unsolicited one. For 
more information please visit http://gump.apache.org/nagged.html, 
and/or contact the folk at general@gump.apache.org.

Project commons-exec has an issue affecting its community integration.
This issue affects 1 projects,
 and has been outstanding for 10 runs.
The current state of this project is 'Failed', with reason 'Build Failed'.
For reference only, the following projects are affected by this:
    - commons-exec :  Commons Exec Package


Full details are available at:
    http://gump-vm.apache.org/commons-exec/commons-exec/index.html

That said, some information snippets are provided here.

The following annotations (debug/informational/warning/error messages) were provided:
 -DEBUG- Sole jar output [commons-exec-*[0-9T].jar] identifier set to project name
 -INFO- Optional dependency commons-lang failed with reason build failed
 -INFO- Optional dependency commons-cli prerequisite failed with reason build failed
 -INFO- Optional dependency junit failed with reason build failed
 -DEBUG- (Apache Gump generated) Apache Maven Settings in: /srv/gump/public/workspace/commons-exec/gump_mvn_settings.xml
 -INFO- Failed with reason build failed
 -DEBUG- Maven POM in: /srv/gump/public/workspace/commons-exec/pom.xml
 -DEBUG- Extracted fallback artifacts from Gump Repository



The following work was performed:
http://gump-vm.apache.org/commons-exec/commons-exec/gump_work/build_commons-exec_commons-exec.html
Work Name: build_commons-exec_commons-exec (Type: Build)
Work ended in a state of : Failed
Elapsed: 7 secs
Command Line: /opt/maven3/bin/mvn --batch-mode -DskipTests=true --settings /srv/gump/public/workspace/commons-exec/gump_mvn_settings.xml package 
[Working Directory: /srv/gump/public/workspace/commons-exec]
M2_HOME: /opt/maven3
---------------------------------------------
[INFO] Scanning for projects...
[INFO] Downloading from gump-central: http://localhost:8192/maven2/org/apache/commons/commons-parent/38/commons-parent-38.pom
[ERROR] [ERROR] Some problems were encountered while processing the POMs:
[FATAL] Non-resolvable parent POM for org.apache.commons:commons-exec:1.4.0-SNAPSHOT: Could not transfer artifact org.apache.commons:commons-parent:pom:38 from/to gump-central (http://localhost:8192/maven2): Failed to transfer file http://localhost:8192/maven2/org/apache/commons/commons-parent/38/commons-parent-38.pom with status code 501 and 'parent.relativePath' points at wrong local POM @ line 19, column 13
 @ 
[ERROR] The build could not read 1 project -> [Help 1]
[ERROR]   
[ERROR]   The project org.apache.commons:commons-exec:1.4.0-SNAPSHOT (/srv/gump/public/workspace/commons-exec/pom.xml) has 1 error
[ERROR]     Non-resolvable parent POM for org.apache.commons:commons-exec:1.4.0-SNAPSHOT: Could not transfer artifact org.apache.commons:commons-parent:pom:38 from/to gump-central (http://localhost:8192/maven2): Failed to transfer file http://localhost:8192/maven2/org/apache/commons/commons-parent/38/commons-parent-38.pom with status code 501 and 'parent.relativePath' points at wrong local POM @ line 19, column 13 -> [Help 2]
[ERROR] 
[ERROR] To see the full stack trace of the errors, re-run Maven with the -e switch.
[ERROR] Re-run Maven using the -X switch to enable full debug logging.
[ERROR] 
[ERROR] For more information about the errors and possible solutions, please read the following articles:
[ERROR] [Help 1] http://cwiki.apache.org/confluence/display/MAVEN/ProjectBuildingException
[ERROR] [Help 2] http://cwiki.apache.org/confluence/display/MAVEN/UnresolvableModelException
---------------------------------------------

To subscribe to this information via syndicated feeds:
- RSS: http://gump-vm.apache.org/commons-exec/commons-exec/rss.xml
- Atom: http://gump-vm.apache.org/commons-exec/commons-exec/atom.xml

============================== Gump Tracking Only ===
Produced by Apache Gump(TM) version 2.3.
Gump Run 20200119000005, gump-vm.apache.org:vmgump:20200119000005
Gump E-mail Identifier (unique within run) #14.


--
Apache Gump
http://gump.apache.org/ [Instance: gump-vm.apache.org]

---------------------------------------------------------------------
To unsubscribe, e-mail: general-unsubscribe@gump.apache.org
For additional commands, e-mail: general-help@gump.apache.org


Mime
View raw message