hadoop-common-issues mailing list archives

Site index · List index
Message view « Date » · « Thread »
Top « Date » · « Thread »
From "Akira Ajisaka (JIRA)" <j...@apache.org>
Subject [jira] [Updated] (HADOOP-16115) [JDK11] TestJersey fails
Date Fri, 15 Feb 2019 10:55:00 GMT

     [ https://issues.apache.org/jira/browse/HADOOP-16115?page=com.atlassian.jira.plugin.system.issuetabpanels:all-tabpanel
]

Akira Ajisaka updated HADOOP-16115:
-----------------------------------
    Description: 
{noformat}
[INFO] Running org.apache.hadoop.http.TestHttpServer
[ERROR] Tests run: 26, Failures: 0, Errors: 1, Skipped: 0, Time elapsed: 5.954 s <<<
FAILURE! - in org.apache.hadoop.http.TestHttpServer
[ERROR] testJersey(org.apache.hadoop.http.TestHttpServer)  Time elapsed: 0.128 s  <<<
ERROR!
java.io.IOException: Server returned HTTP response code: 500 for URL: http://localhost:40339/jersey/foo?op=bar
	at java.base/sun.net.www.protocol.http.HttpURLConnection.getInputStream0(HttpURLConnection.java:1913)
	at java.base/sun.net.www.protocol.http.HttpURLConnection.getInputStream(HttpURLConnection.java:1509)
	at org.apache.hadoop.http.HttpServerFunctionalTest.readOutput(HttpServerFunctionalTest.java:260)
	at org.apache.hadoop.http.TestHttpServer.testJersey(TestHttpServer.java:526)
	at java.base/jdk.internal.reflect.NativeMethodAccessorImpl.invoke0(Native Method)
	at java.base/jdk.internal.reflect.NativeMethodAccessorImpl.invoke(NativeMethodAccessorImpl.java:62)
	at java.base/jdk.internal.reflect.DelegatingMethodAccessorImpl.invoke(DelegatingMethodAccessorImpl.java:43)
	at java.base/java.lang.reflect.Method.invoke(Method.java:566)
	at org.junit.runners.model.FrameworkMethod$1.runReflectiveCall(FrameworkMethod.java:50)
	at org.junit.internal.runners.model.ReflectiveCallable.run(ReflectiveCallable.java:12)
	at org.junit.runners.model.FrameworkMethod.invokeExplosively(FrameworkMethod.java:47)
	at org.junit.internal.runners.statements.InvokeMethod.evaluate(InvokeMethod.java:17)
	at org.junit.rules.ExpectedException$ExpectedExceptionStatement.evaluate(ExpectedException.java:239)
	at org.junit.rules.RunRules.evaluate(RunRules.java:20)
	at org.junit.runners.ParentRunner.runLeaf(ParentRunner.java:325)
	at org.junit.runners.BlockJUnit4ClassRunner.runChild(BlockJUnit4ClassRunner.java:78)
	at org.junit.runners.BlockJUnit4ClassRunner.runChild(BlockJUnit4ClassRunner.java:57)
	at org.junit.runners.ParentRunner$3.run(ParentRunner.java:290)
	at org.junit.runners.ParentRunner$1.schedule(ParentRunner.java:71)
	at org.junit.runners.ParentRunner.runChildren(ParentRunner.java:288)
	at org.junit.runners.ParentRunner.access$000(ParentRunner.java:58)
	at org.junit.runners.ParentRunner$2.evaluate(ParentRunner.java:268)
	at org.junit.internal.runners.statements.RunBefores.evaluate(RunBefores.java:26)
	at org.junit.internal.runners.statements.RunAfters.evaluate(RunAfters.java:27)
	at org.junit.runners.ParentRunner.run(ParentRunner.java:363)
	at org.apache.maven.surefire.junit4.JUnit4Provider.execute(JUnit4Provider.java:365)
	at org.apache.maven.surefire.junit4.JUnit4Provider.executeWithRerun(JUnit4Provider.java:273)
	at org.apache.maven.surefire.junit4.JUnit4Provider.executeTestSet(JUnit4Provider.java:238)
	at org.apache.maven.surefire.junit4.JUnit4Provider.invoke(JUnit4Provider.java:159)
	at org.apache.maven.surefire.booter.ForkedBooter.invokeProviderInSameClassLoader(ForkedBooter.java:384)
	at org.apache.maven.surefire.booter.ForkedBooter.runSuitesInProcess(ForkedBooter.java:345)
	at org.apache.maven.surefire.booter.ForkedBooter.execute(ForkedBooter.java:126)
	at org.apache.maven.surefire.booter.ForkedBooter.main(ForkedBooter.java:418)
{noformat}

> [JDK11] TestJersey fails
> ------------------------
>
>                 Key: HADOOP-16115
>                 URL: https://issues.apache.org/jira/browse/HADOOP-16115
>             Project: Hadoop Common
>          Issue Type: Sub-task
>            Reporter: Akira Ajisaka
>            Priority: Major
>
> {noformat}
> [INFO] Running org.apache.hadoop.http.TestHttpServer
> [ERROR] Tests run: 26, Failures: 0, Errors: 1, Skipped: 0, Time elapsed: 5.954 s <<<
FAILURE! - in org.apache.hadoop.http.TestHttpServer
> [ERROR] testJersey(org.apache.hadoop.http.TestHttpServer)  Time elapsed: 0.128 s  <<<
ERROR!
> java.io.IOException: Server returned HTTP response code: 500 for URL: http://localhost:40339/jersey/foo?op=bar
> 	at java.base/sun.net.www.protocol.http.HttpURLConnection.getInputStream0(HttpURLConnection.java:1913)
> 	at java.base/sun.net.www.protocol.http.HttpURLConnection.getInputStream(HttpURLConnection.java:1509)
> 	at org.apache.hadoop.http.HttpServerFunctionalTest.readOutput(HttpServerFunctionalTest.java:260)
> 	at org.apache.hadoop.http.TestHttpServer.testJersey(TestHttpServer.java:526)
> 	at java.base/jdk.internal.reflect.NativeMethodAccessorImpl.invoke0(Native Method)
> 	at java.base/jdk.internal.reflect.NativeMethodAccessorImpl.invoke(NativeMethodAccessorImpl.java:62)
> 	at java.base/jdk.internal.reflect.DelegatingMethodAccessorImpl.invoke(DelegatingMethodAccessorImpl.java:43)
> 	at java.base/java.lang.reflect.Method.invoke(Method.java:566)
> 	at org.junit.runners.model.FrameworkMethod$1.runReflectiveCall(FrameworkMethod.java:50)
> 	at org.junit.internal.runners.model.ReflectiveCallable.run(ReflectiveCallable.java:12)
> 	at org.junit.runners.model.FrameworkMethod.invokeExplosively(FrameworkMethod.java:47)
> 	at org.junit.internal.runners.statements.InvokeMethod.evaluate(InvokeMethod.java:17)
> 	at org.junit.rules.ExpectedException$ExpectedExceptionStatement.evaluate(ExpectedException.java:239)
> 	at org.junit.rules.RunRules.evaluate(RunRules.java:20)
> 	at org.junit.runners.ParentRunner.runLeaf(ParentRunner.java:325)
> 	at org.junit.runners.BlockJUnit4ClassRunner.runChild(BlockJUnit4ClassRunner.java:78)
> 	at org.junit.runners.BlockJUnit4ClassRunner.runChild(BlockJUnit4ClassRunner.java:57)
> 	at org.junit.runners.ParentRunner$3.run(ParentRunner.java:290)
> 	at org.junit.runners.ParentRunner$1.schedule(ParentRunner.java:71)
> 	at org.junit.runners.ParentRunner.runChildren(ParentRunner.java:288)
> 	at org.junit.runners.ParentRunner.access$000(ParentRunner.java:58)
> 	at org.junit.runners.ParentRunner$2.evaluate(ParentRunner.java:268)
> 	at org.junit.internal.runners.statements.RunBefores.evaluate(RunBefores.java:26)
> 	at org.junit.internal.runners.statements.RunAfters.evaluate(RunAfters.java:27)
> 	at org.junit.runners.ParentRunner.run(ParentRunner.java:363)
> 	at org.apache.maven.surefire.junit4.JUnit4Provider.execute(JUnit4Provider.java:365)
> 	at org.apache.maven.surefire.junit4.JUnit4Provider.executeWithRerun(JUnit4Provider.java:273)
> 	at org.apache.maven.surefire.junit4.JUnit4Provider.executeTestSet(JUnit4Provider.java:238)
> 	at org.apache.maven.surefire.junit4.JUnit4Provider.invoke(JUnit4Provider.java:159)
> 	at org.apache.maven.surefire.booter.ForkedBooter.invokeProviderInSameClassLoader(ForkedBooter.java:384)
> 	at org.apache.maven.surefire.booter.ForkedBooter.runSuitesInProcess(ForkedBooter.java:345)
> 	at org.apache.maven.surefire.booter.ForkedBooter.execute(ForkedBooter.java:126)
> 	at org.apache.maven.surefire.booter.ForkedBooter.main(ForkedBooter.java:418)
> {noformat}



--
This message was sent by Atlassian JIRA
(v7.6.3#76005)

---------------------------------------------------------------------
To unsubscribe, e-mail: common-issues-unsubscribe@hadoop.apache.org
For additional commands, e-mail: common-issues-help@hadoop.apache.org


Mime
View raw message