hadoop-mapreduce-dev mailing list archives

Site index · List index
Message view « Date » · « Thread »
Top « Date » · « Thread »
From Apache Hudson Server <hud...@hudson.zones.apache.org>
Subject Build failed in Hudson: Mapreduce-Patch-vesta.apache.org #336
Date Thu, 02 Jul 2009 21:06:50 GMT
See http://hudson.zones.apache.org/hudson/job/Mapreduce-Patch-vesta.apache.org/336/

------------------------------------------
[...truncated 145515 lines...]
     [exec]     [junit] 09/07/02 21:06:15 INFO mapred.TaskTracker: attempt_200907022051_0001_r_000000_0
0.0% reduce > copy > 
     [exec]     [junit] 09/07/02 21:06:15 INFO mapred.TaskTracker: attempt_200907022051_0001_r_000004_0
0.0% reduce > copy > 
     [exec]     [junit] 09/07/02 21:06:16 INFO mapred.ControlledMapReduceJob: Waiting till
4 reduce tasks of the job job_200907022051_0001 finish. 0 tasks already got finished.
     [exec]     [junit] 09/07/02 21:06:16 INFO mapred.JobInProgress: Failed fetch notification
#2 for task attempt_200907022051_0001_m_000012_0
     [exec]     [junit] 09/07/02 21:06:16 INFO mapred.TaskTracker: attempt_200907022051_0001_r_000001_0
0.0% reduce > copy > 
     [exec]     [junit] 09/07/02 21:06:16 INFO mapred.TaskTracker: attempt_200907022051_0001_r_000005_0
0.0% reduce > copy > 
     [exec]     [junit] 09/07/02 21:06:17 INFO mapred.ControlledMapReduceJob: Waiting till
4 reduce tasks of the job job_200907022051_0001 finish. 0 tasks already got finished.
     [exec]     [junit] 09/07/02 21:06:17 INFO mapred.TaskTracker: attempt_200907022051_0001_r_000006_0
0.0% reduce > copy > 
     [exec]     [junit] 09/07/02 21:06:17 INFO mapred.TaskTracker: attempt_200907022051_0001_r_000002_0
0.0% reduce > copy > 
     [exec]     [junit] 09/07/02 21:06:18 INFO mapred.TaskTracker: attempt_200907022051_0001_r_000007_0
0.0% reduce > copy > 
     [exec]     [junit] 09/07/02 21:06:18 INFO mapred.TaskTracker: attempt_200907022051_0001_r_000003_0
0.0% reduce > copy > 
     [exec]     [junit] 09/07/02 21:06:18 INFO mapred.ControlledMapReduceJob: Waiting till
4 reduce tasks of the job job_200907022051_0001 finish. 0 tasks already got finished.
     [exec]     [junit] 09/07/02 21:06:18 INFO mapred.TaskTracker: attempt_200907022051_0001_r_000008_0
0.0% reduce > copy > 
     [exec]     [junit] 09/07/02 21:06:19 INFO mapred.ControlledMapReduceJob: Waiting till
4 reduce tasks of the job job_200907022051_0001 finish. 0 tasks already got finished.
     [exec]     [junit] 09/07/02 21:06:19 INFO mapred.TaskTracker: attempt_200907022051_0001_r_000009_0
0.0% reduce > copy > 
     [exec]     [junit] 09/07/02 21:06:20 INFO mapred.JobInProgress: Failed fetch notification
#3 for task attempt_200907022051_0001_m_000012_0
     [exec]     [junit] 09/07/02 21:06:20 INFO mapred.ControlledMapReduceJob: Waiting till
4 reduce tasks of the job job_200907022051_0001 finish. 0 tasks already got finished.
     [exec]     [junit] 09/07/02 21:06:20 INFO mapred.TaskTracker: attempt_200907022051_0001_r_000010_0
0.0% reduce > copy > 
     [exec]     [junit] 09/07/02 21:06:21 INFO mapred.TaskTracker: attempt_200907022051_0001_r_000011_0
0.0% reduce > copy > 
     [exec]     [junit] 09/07/02 21:06:21 INFO mapred.JobInProgress: Failed fetch notification
#4 for task attempt_200907022051_0001_m_000012_0
     [exec]     [junit] 09/07/02 21:06:21 INFO mapred.ControlledMapReduceJob: Waiting till
4 reduce tasks of the job job_200907022051_0001 finish. 0 tasks already got finished.
     [exec]     [junit] Running org.apache.hadoop.mapred.TestQueueCapacities
     [exec]     [junit] Test org.apache.hadoop.mapred.TestQueueCapacities FAILED (timeout)
     [exec]     [junit] Tests run: 1, Failures: 0, Errors: 1, Time elapsed: 0 sec
     [exec] 
     [exec] checkfailure:
     [exec] 
     [exec] check-contrib:
     [exec] 
     [exec] init:
     [exec]      [echo] contrib: mrunit
     [exec] 
     [exec] init-contrib:
     [exec] 
     [exec] ivy-download:
     [exec]       [get] Getting: http://repo2.maven.org/maven2/org/apache/ivy/ivy/2.0.0-rc2/ivy-2.0.0-rc2.jar
     [exec]       [get] To: http://hudson.zones.apache.org/hudson/job/Mapreduce-Patch-vesta.apache.org/ws/trunk/ivy/ivy-2.0.0-rc2.jar

     [exec]       [get] Not modified - so not downloaded
     [exec] 
     [exec] ivy-probe-antlib:
     [exec] 
     [exec] ivy-init-antlib:
     [exec] 
     [exec] ivy-init:
     [exec] :: loading settings :: file = http://hudson.zones.apache.org/hudson/job/Mapreduce-Patch-vesta.apache.org/ws/trunk/ivy/ivysettings.xml

     [exec] 
     [exec] ivy-resolve-common:
     [exec] [ivy:resolve] :: resolving dependencies :: org.apache.hadoop#mrunit;working@vesta.apache.org
     [exec] [ivy:resolve] 	confs: [common]
     [exec] [ivy:resolve] 	found commons-logging#commons-logging;1.0.4 in maven2
     [exec] [ivy:resolve] 	found log4j#log4j;1.2.15 in maven2
     [exec] [ivy:resolve] 	found junit#junit;4.5 in maven2
     [exec] [ivy:resolve] :: resolution report :: resolve 19ms :: artifacts dl 1ms
     [exec] 	---------------------------------------------------------------------
     [exec] 	|                  |            modules            ||   artifacts   |
     [exec] 	|       conf       | number| search|dwnlded|evicted|| number|dwnlded|
     [exec] 	---------------------------------------------------------------------
     [exec] 	|      common      |   3   |   0   |   0   |   0   ||   3   |   0   |
     [exec] 	---------------------------------------------------------------------
     [exec] 
     [exec] ivy-retrieve-common:
     [exec] [ivy:retrieve] :: retrieving :: org.apache.hadoop#mrunit [sync]
     [exec] [ivy:retrieve] 	confs: [common]
     [exec] [ivy:retrieve] 	0 artifacts copied, 3 already retrieved (0kB/1ms)
     [exec] No ivy:settings found for the default reference 'ivy.instance'.  A default instance
will be used
     [exec] DEPRECATED: 'ivy.conf.file' is deprecated, use 'ivy.settings.file' instead
     [exec] :: loading settings :: file = http://hudson.zones.apache.org/hudson/job/Mapreduce-Patch-vesta.apache.org/ws/trunk/ivy/ivysettings.xml

     [exec] 
     [exec] compile:
     [exec]      [echo] contrib: mrunit
     [exec] 
     [exec] compile-examples:
     [exec] 
     [exec] compile-test:
     [exec]      [echo] contrib: mrunit
     [exec]     [javac] Compiling 9 source files to http://hudson.zones.apache.org/hudson/job/Mapreduce-Patch-vesta.apache.org/ws/trunk/build/contrib/mrunit/test

     [exec]     [javac] Note: Some input files use or override a deprecated API.
     [exec]     [javac] Note: Recompile with -Xlint:deprecation for details.
     [exec] 
     [exec] test:
     [exec]      [echo] contrib: mrunit
     [exec]    [delete] Deleting directory http://hudson.zones.apache.org/hudson/job/Mapreduce-Patch-vesta.apache.org/ws/trunk/build/contrib/mrunit/test/logs

     [exec]     [mkdir] Created dir: http://hudson.zones.apache.org/hudson/job/Mapreduce-Patch-vesta.apache.org/ws/trunk/build/contrib/mrunit/test/logs

     [exec]     [junit] Running org.apache.hadoop.mrunit.TestExample
     [exec]     [junit] Tests run: 1, Failures: 0, Errors: 0, Time elapsed: 0.146 sec
     [exec]     [junit] Running org.apache.hadoop.mrunit.TestMapDriver
     [exec]     [junit] 09/07/02 21:06:23 ERROR mrunit.TestDriver: Expected no outputs; got
1 outputs.
     [exec]     [junit] 09/07/02 21:06:23 ERROR mrunit.TestDriver: Received unexpected output
(null, null)
     [exec]     [junit] Tests run: 5, Failures: 0, Errors: 0, Time elapsed: 0.15 sec
     [exec]     [junit] Running org.apache.hadoop.mrunit.TestMapReduceDriver
     [exec]     [junit] 09/07/02 21:06:23 ERROR mrunit.TestDriver: Missing expected output
(foo, 52) at position 0
     [exec]     [junit] Tests run: 8, Failures: 0, Errors: 0, Time elapsed: 0.156 sec
     [exec]     [junit] Running org.apache.hadoop.mrunit.TestReduceDriver
     [exec]     [junit] 09/07/02 21:06:24 ERROR mrunit.TestDriver: Expected no outputs; got
1 outputs.
     [exec]     [junit] 09/07/02 21:06:24 ERROR mrunit.TestDriver: Received unexpected output
(null, 0)
     [exec]     [junit] Tests run: 3, Failures: 0, Errors: 0, Time elapsed: 0.147 sec
     [exec]     [junit] Running org.apache.hadoop.mrunit.TestTestDriver
     [exec]     [junit] Tests run: 19, Failures: 0, Errors: 0, Time elapsed: 0.146 sec
     [exec]     [junit] Running org.apache.hadoop.mrunit.mock.TestMockReporter
     [exec]     [junit] Tests run: 2, Failures: 0, Errors: 0, Time elapsed: 0.06 sec
     [exec]     [junit] Running org.apache.hadoop.mrunit.types.TestPair
     [exec]     [junit] Tests run: 20, Failures: 0, Errors: 0, Time elapsed: 0.062 sec
     [exec] 
     [exec] checkfailure:
     [exec] 
     [exec] check-contrib:
     [exec] 
     [exec] init:
     [exec]      [echo] contrib: dynamic-priority
     [exec] 
     [exec] init-contrib:
     [exec] 
     [exec] ivy-download:
     [exec]       [get] Getting: http://repo2.maven.org/maven2/org/apache/ivy/ivy/2.0.0-rc2/ivy-2.0.0-rc2.jar
     [exec]       [get] To: http://hudson.zones.apache.org/hudson/job/Mapreduce-Patch-vesta.apache.org/ws/trunk/ivy/ivy-2.0.0-rc2.jar

     [exec]       [get] Not modified - so not downloaded
     [exec] 
     [exec] ivy-probe-antlib:
     [exec] 
     [exec] ivy-init-antlib:
     [exec] 
     [exec] ivy-init:
     [exec] :: loading settings :: file = http://hudson.zones.apache.org/hudson/job/Mapreduce-Patch-vesta.apache.org/ws/trunk/ivy/ivysettings.xml

     [exec] 
     [exec] ivy-resolve-common:
     [exec] [ivy:resolve] :: resolving dependencies :: org.apache.hadoop#dynamic-priority;working@vesta.apache.org
     [exec] [ivy:resolve] 	confs: [common]
     [exec] [ivy:resolve] 	found commons-logging#commons-logging;1.0.4 in maven2
     [exec] [ivy:resolve] 	found log4j#log4j;1.2.15 in maven2
     [exec] [ivy:resolve] 	found commons-httpclient#commons-httpclient;3.0.1 in maven2
     [exec] [ivy:resolve] 	found commons-codec#commons-codec;1.3 in maven2
     [exec] [ivy:resolve] 	found xmlenc#xmlenc;0.52 in maven2
     [exec] [ivy:resolve] 	found net.java.dev.jets3t#jets3t;0.6.1 in maven2
     [exec] [ivy:resolve] 	found commons-net#commons-net;1.4.1 in maven2
     [exec] [ivy:resolve] 	found org.mortbay.jetty#servlet-api-2.5;6.1.14 in maven2
     [exec] [ivy:resolve] 	found oro#oro;2.0.8 in maven2
     [exec] [ivy:resolve] 	found org.mortbay.jetty#jetty;6.1.14 in maven2
     [exec] [ivy:resolve] 	found org.mortbay.jetty#jetty-util;6.1.14 in maven2
     [exec] [ivy:resolve] 	found tomcat#jasper-runtime;5.5.12 in maven2
     [exec] [ivy:resolve] 	found tomcat#jasper-compiler;5.5.12 in maven2
     [exec] [ivy:resolve] 	found commons-el#commons-el;1.0 in maven2
     [exec] [ivy:resolve] 	found junit#junit;4.5 in maven2
     [exec] [ivy:resolve] 	found commons-logging#commons-logging-api;1.0.4 in maven2
     [exec] [ivy:resolve] 	found org.slf4j#slf4j-api;1.4.3 in maven2
     [exec] [ivy:resolve] 	found org.slf4j#slf4j-log4j12;1.4.3 in maven2
     [exec] [ivy:resolve] :: resolution report :: resolve 138ms :: artifacts dl 8ms
     [exec] 	---------------------------------------------------------------------
     [exec] 	|                  |            modules            ||   artifacts   |
     [exec] 	|       conf       | number| search|dwnlded|evicted|| number|dwnlded|
     [exec] 	---------------------------------------------------------------------
     [exec] 	|      common      |   18  |   0   |   0   |   0   ||   18  |   0   |
     [exec] 	---------------------------------------------------------------------
     [exec] 
     [exec] ivy-retrieve-common:
     [exec] [ivy:retrieve] :: retrieving :: org.apache.hadoop#dynamic-priority [sync]
     [exec] [ivy:retrieve] 	confs: [common]
     [exec] [ivy:retrieve] 	0 artifacts copied, 18 already retrieved (0kB/5ms)
     [exec] No ivy:settings found for the default reference 'ivy.instance'.  A default instance
will be used
     [exec] DEPRECATED: 'ivy.conf.file' is deprecated, use 'ivy.settings.file' instead
     [exec] :: loading settings :: file = http://hudson.zones.apache.org/hudson/job/Mapreduce-Patch-vesta.apache.org/ws/trunk/ivy/ivysettings.xml

     [exec] 
     [exec] compile:
     [exec]      [echo] contrib: dynamic-priority
     [exec] 
     [exec] compile-examples:
     [exec] 
     [exec] compile-test:
     [exec]      [echo] contrib: dynamic-priority
     [exec]     [javac] Compiling 4 source files to http://hudson.zones.apache.org/hudson/job/Mapreduce-Patch-vesta.apache.org/ws/trunk/build/contrib/dynamic-priority/test

     [exec]     [javac] Note: http://hudson.zones.apache.org/hudson/job/Mapreduce-Patch-vesta.apache.org/ws/trunk/src/contrib/dynamic-scheduler/src/test/org/apache/hadoop/mapred/BaseSchedulerTest.java
 uses or overrides a deprecated API.
     [exec]     [javac] Note: Recompile with -Xlint:deprecation for details.
     [exec] 
     [exec] test:
     [exec]      [echo] contrib: dynamic-priority
     [exec]    [delete] Deleting directory http://hudson.zones.apache.org/hudson/job/Mapreduce-Patch-vesta.apache.org/ws/trunk/build/contrib/dynamic-priority/test/logs

     [exec]     [mkdir] Created dir: http://hudson.zones.apache.org/hudson/job/Mapreduce-Patch-vesta.apache.org/ws/trunk/build/contrib/dynamic-priority/test/logs

     [exec]     [junit] Running org.apache.hadoop.mapred.TestDynamicScheduler
     [exec]     [junit] Tests run: 3, Failures: 0, Errors: 0, Time elapsed: 0.161 sec
     [exec]     [junit] Running org.apache.hadoop.mapred.TestPriorityScheduler
     [exec]     [junit] Tests run: 2, Failures: 0, Errors: 0, Time elapsed: 0.144 sec
     [exec] 
     [exec] checkfailure:
     [exec] 
     [exec] BUILD FAILED
     [exec] http://hudson.zones.apache.org/hudson/job/Mapreduce-Patch-vesta.apache.org/ws/trunk/build.xml
:601: The following error occurred while executing this line:
     [exec] http://hudson.zones.apache.org/hudson/job/Mapreduce-Patch-vesta.apache.org/ws/trunk/src/contrib/build.xml
:60: Tests failed!
     [exec] 
     [exec] Total time: 21 minutes 43 seconds
     [exec] 
     [exec] 
     [exec] 
     [exec] 
     [exec] -1 overall.  Here are the results of testing the latest attachment 
     [exec]   http://issues.apache.org/jira/secure/attachment/12412038/659-1.patch
     [exec]   against trunk revision 790543.
     [exec] 
     [exec]     +1 @author.  The patch does not contain any @author tags.
     [exec] 
     [exec]     -1 tests included.  The patch doesn't appear to include any new or modified
tests.
     [exec]                         Please justify why no new tests are needed for this patch.
     [exec]                         Also please list what manual steps were performed to verify
this patch.
     [exec] 
     [exec]     +1 javadoc.  The javadoc tool did not generate any warning messages.
     [exec] 
     [exec]     +1 javac.  The applied patch does not increase the total number of javac compiler
warnings.
     [exec] 
     [exec]     +1 findbugs.  The patch does not introduce any new Findbugs warnings.
     [exec] 
     [exec]     +1 release audit.  The applied patch does not increase the total number of
release audit warnings.
     [exec] 
     [exec]     -1 core tests.  The patch failed core unit tests.
     [exec] 
     [exec]     -1 contrib tests.  The patch failed contrib unit tests.
     [exec] 
     [exec] Test results: http://hudson.zones.apache.org/hudson/job/Mapreduce-Patch-vesta.apache.org/336/testReport/
     [exec] Findbugs warnings: http://hudson.zones.apache.org/hudson/job/Mapreduce-Patch-vesta.apache.org/336/artifact/trunk/build/test/findbugs/newPatchFindbugsWarnings.html
     [exec] Checkstyle results: http://hudson.zones.apache.org/hudson/job/Mapreduce-Patch-vesta.apache.org/336/artifact/trunk/build/test/checkstyle-errors.html
     [exec] Console output: http://hudson.zones.apache.org/hudson/job/Mapreduce-Patch-vesta.apache.org/336/console
     [exec] 
     [exec] This message is automatically generated.
     [exec] 
     [exec] 
     [exec] ======================================================================
     [exec] ======================================================================
     [exec]     Adding comment to Jira.
     [exec] ======================================================================
     [exec] ======================================================================
     [exec] 
     [exec] 
     [exec]   % Total    % Received % Xferd  Average Speed   Time    Time     Time  Current
     [exec]                                  Dload  Upload   Total   Spent    Left  Speed
     [exec] 
     [exec]   0     0    0     0    0     0      0      0 --:--:-- --:--:-- --:--:--     0
 0     0    0     0    0     0      0      0 --:--:-- --:--:-- --:--:--     0
     [exec] 
     [exec] 
     [exec] ======================================================================
     [exec] ======================================================================
     [exec]     Finished build.
     [exec] ======================================================================
     [exec] ======================================================================
     [exec] 
     [exec] 

BUILD FAILED
http://hudson.zones.apache.org/hudson/job/Mapreduce-Patch-vesta.apache.org/ws/trunk/build.xml
:1373: exec returned: 3

Total time: 181 minutes 4 seconds
Recording test results
Description found: MAPREDUCE-659


Mime
View raw message