hadoop-mapreduce-dev mailing list archives

Site index · List index
Message view « Date » · « Thread »
Top « Date » · « Thread »
From Apache Jenkins Server <jenk...@builds.apache.org>
Subject Hadoop-Mapreduce-22-branch - Build # 70 - Still Failing
Date Thu, 15 Sep 2011 16:48:18 GMT
See https://builds.apache.org/job/Hadoop-Mapreduce-22-branch/70/

###################################################################################
########################## LAST 60 LINES OF THE CONSOLE ###########################
[...truncated 4708 lines...]

examples:

ivy-resolve-test:

ivy-retrieve-test:

compile-mapred-test:
    [javac] Compiling 8 source files to /home/jenkins/jenkins-slave/workspace/Hadoop-Mapreduce-22-branch/trunk/build/test/mapred/testjar
    [javac] Note: Some input files use or override a deprecated API.
    [javac] Note: Recompile with -Xlint:deprecation for details.
   [delete] Deleting: /home/jenkins/jenkins-slave/workspace/Hadoop-Mapreduce-22-branch/trunk/build/test/mapred/testjar/testjob.jar
      [jar] Building jar: /home/jenkins/jenkins-slave/workspace/Hadoop-Mapreduce-22-branch/trunk/build/test/mapred/testjar/testjob.jar
    [javac] Compiling 1 source file to /home/jenkins/jenkins-slave/workspace/Hadoop-Mapreduce-22-branch/trunk/build/test/mapred/testshell
    [javac] Note: /home/jenkins/jenkins-slave/workspace/Hadoop-Mapreduce-22-branch/trunk/src/test/mapred/testshell/ExternalMapReduce.java
uses or overrides a deprecated API.
    [javac] Note: Recompile with -Xlint:deprecation for details.
   [delete] Deleting: /home/jenkins/jenkins-slave/workspace/Hadoop-Mapreduce-22-branch/trunk/build/test/mapred/testshell/testshell.jar
      [jar] Building jar: /home/jenkins/jenkins-slave/workspace/Hadoop-Mapreduce-22-branch/trunk/build/test/mapred/testshell/testshell.jar
   [delete] Deleting directory /home/jenkins/jenkins-slave/workspace/Hadoop-Mapreduce-22-branch/trunk/build/test/cache
    [mkdir] Created dir: /home/jenkins/jenkins-slave/workspace/Hadoop-Mapreduce-22-branch/trunk/build/test/cache
   [delete] Deleting directory /home/jenkins/jenkins-slave/workspace/Hadoop-Mapreduce-22-branch/trunk/build/test/debug
    [mkdir] Created dir: /home/jenkins/jenkins-slave/workspace/Hadoop-Mapreduce-22-branch/trunk/build/test/debug
     [copy] Copying 1 file to /home/jenkins/jenkins-slave/workspace/Hadoop-Mapreduce-22-branch/trunk/build/test/debug
     [copy] Copying 1 file to /home/jenkins/jenkins-slave/workspace/Hadoop-Mapreduce-22-branch/trunk/build/test/cache
     [copy] Copying 1 file to /home/jenkins/jenkins-slave/workspace/Hadoop-Mapreduce-22-branch/trunk/build/test/cache
     [copy] Copying 1 file to /home/jenkins/jenkins-slave/workspace/Hadoop-Mapreduce-22-branch/trunk/build/test/cache
     [copy] Copying 1 file to /home/jenkins/jenkins-slave/workspace/Hadoop-Mapreduce-22-branch/trunk/build/test/cache
     [copy] Copying 1 file to /home/jenkins/jenkins-slave/workspace/Hadoop-Mapreduce-22-branch/trunk/build/test/cache
     [copy] Copying 1 file to /home/jenkins/jenkins-slave/workspace/Hadoop-Mapreduce-22-branch/trunk/build/test/cache
     [copy] Copying 1 file to /home/jenkins/jenkins-slave/workspace/Hadoop-Mapreduce-22-branch/trunk/build/test/cache
     [copy] Copying 1 file to /home/jenkins/jenkins-slave/workspace/Hadoop-Mapreduce-22-branch/trunk/build/test/cache

jar-test:

-do-jar-test:

all-jars:

BUILD FAILED
/home/jenkins/jenkins-slave/workspace/Hadoop-Mapreduce-22-branch/trunk/build.xml:875: The
following error occurred while executing this line:
/home/jenkins/jenkins-slave/workspace/Hadoop-Mapreduce-22-branch/trunk/src/contrib/capacity-scheduler/build.xml:26:
The following error occurred while executing this line:
/home/jenkins/jenkins-slave/workspace/Hadoop-Mapreduce-22-branch/trunk/src/contrib/build-contrib.xml:83:
Source resource does not exist: /home/jenkins/jenkins-slave/ivy/libraries.properties

Total time: 4 minutes 7 seconds
+ RESULT=1
+ [ 1 != 0 ]
+ echo Build Failed: remaining tests not run
Build Failed: remaining tests not run
+ exit 1
Build step 'Execute shell' marked build as failure
[FINDBUGS] Skipping publisher since build result is FAILURE
Archiving artifacts
Publishing Clover coverage report...
No Clover report will be published due to a Build Failure
Recording test results
Publishing Javadoc
Recording fingerprints
Email was triggered for: Failure
Sending email for trigger: Failure



###################################################################################
############################## FAILED TESTS (if any) ##############################
No tests ran.

Mime
View raw message