hadoop-mapreduce-dev mailing list archives

Site index · List index
Message view « Date » · « Thread »
Top « Date » · « Thread »
From Apache Jenkins Server <jenk...@builds.apache.org>
Subject Hadoop-Mapreduce-trunk - Build # 1315 - Still Failing
Date Wed, 16 Jan 2013 14:05:09 GMT
See https://builds.apache.org/job/Hadoop-Mapreduce-trunk/1315/

###################################################################################
########################## LAST 60 LINES OF THE CONSOLE ###########################
[...truncated 27842 lines...]
Results :

Failed tests:   testHistoryServerToken(org.apache.hadoop.mapred.TestYARNRunner): null expected:<>
but was:<null>

Tests run: 444, Failures: 1, Errors: 0, Skipped: 12

[INFO] ------------------------------------------------------------------------
[INFO] Reactor Summary:
[INFO] 
[INFO] hadoop-mapreduce-client ........................... SUCCESS [1.695s]
[INFO] hadoop-mapreduce-client-core ...................... SUCCESS [21.256s]
[INFO] hadoop-mapreduce-client-common .................... SUCCESS [23.497s]
[INFO] hadoop-mapreduce-client-shuffle ................... SUCCESS [1.642s]
[INFO] hadoop-mapreduce-client-app ....................... SUCCESS [4:54.959s]
[INFO] hadoop-mapreduce-client-hs ........................ SUCCESS [1:11.543s]
[INFO] hadoop-mapreduce-client-jobclient ................. FAILURE [42:47.809s]
[INFO] hadoop-mapreduce-client-hs-plugins ................ SKIPPED
[INFO] Apache Hadoop MapReduce Examples .................. SKIPPED
[INFO] hadoop-mapreduce .................................. SKIPPED
[INFO] ------------------------------------------------------------------------
[INFO] BUILD FAILURE
[INFO] ------------------------------------------------------------------------
[INFO] Total time: 49:42.972s
[INFO] Finished at: Wed Jan 16 14:04:57 UTC 2013
[INFO] Final Memory: 19M/161M
[INFO] ------------------------------------------------------------------------
[ERROR] Failed to execute goal org.apache.maven.plugins:maven-surefire-plugin:2.12.3:test
(default-test) on project hadoop-mapreduce-client-jobclient: There are test failures.
[ERROR] 
[ERROR] Please refer to /home/jenkins/jenkins-slave/workspace/Hadoop-Mapreduce-trunk/trunk/hadoop-mapreduce-project/hadoop-mapreduce-client/hadoop-mapreduce-client-jobclient/target/surefire-reports
for the individual test results.
[ERROR] -> [Help 1]
[ERROR] 
[ERROR] To see the full stack trace of the errors, re-run Maven with the -e switch.
[ERROR] Re-run Maven using the -X switch to enable full debug logging.
[ERROR] 
[ERROR] For more information about the errors and possible solutions, please read the following
articles:
[ERROR] [Help 1] http://cwiki.apache.org/confluence/display/MAVEN/MojoFailureException
[ERROR] 
[ERROR] After correcting the problems, you can resume the build with the command
[ERROR]   mvn <goals> -rf :hadoop-mapreduce-client-jobclient
Build step 'Execute shell' marked build as failure
[FINDBUGS] Skipping publisher since build result is FAILURE
Archiving artifacts
Updating HDFS-4392
Updating YARN-335
Updating YARN-135
Updating YARN-336
Updating HADOOP-8712
Updating HADOOP-9217
Updating MAPREDUCE-4936
Updating MAPREDUCE-4925
Updating HADOOP-9212
Updating MAPREDUCE-4924
Updating HADOOP-8816
Updating MAPREDUCE-4678
Updating HADOOP-9106
Updating HDFS-4288
Updating HDFS-4399
Email was triggered for: Failure
Sending email for trigger: Failure



###################################################################################
############################## FAILED TESTS (if any) ##############################
No tests ran.
Mime
  • Unnamed multipart/mixed (inline, None, 0 bytes)
View raw message