hadoop-mapreduce-dev mailing list archives

Site index · List index
Message view « Date » · « Thread »
Top « Date » · « Thread »
From Apache Jenkins Server <jenk...@builds.apache.org>
Subject Hadoop-Mapreduce-trunk - Build # 1311 - Still Failing
Date Sat, 12 Jan 2013 13:21:35 GMT
See https://builds.apache.org/job/Hadoop-Mapreduce-trunk/1311/

###################################################################################
########################## LAST 60 LINES OF THE CONSOLE ###########################
[...truncated 28645 lines...]
Tests run: 3, Failures: 0, Errors: 0, Skipped: 0, Time elapsed: 1.139 sec
Running org.apache.hadoop.mapreduce.v2.app.launcher.TestContainerLauncherImpl
Tests run: 4, Failures: 0, Errors: 0, Skipped: 0, Time elapsed: 1.785 sec
Running org.apache.hadoop.mapreduce.v2.app.launcher.TestContainerLauncher
Tests run: 3, Failures: 0, Errors: 0, Skipped: 0, Time elapsed: 12.9 sec
Running org.apache.hadoop.mapreduce.jobhistory.TestJobHistoryEventHandler
Tests run: 5, Failures: 0, Errors: 0, Skipped: 0, Time elapsed: 10.099 sec

Results :

Failed tests:   testUberDecision(org.apache.hadoop.mapreduce.v2.app.job.impl.TestJobImpl)

Tests run: 204, Failures: 1, Errors: 0, Skipped: 0

[INFO] ------------------------------------------------------------------------
[INFO] Reactor Summary:
[INFO] 
[INFO] hadoop-mapreduce-client ........................... SUCCESS [1.683s]
[INFO] hadoop-mapreduce-client-core ...................... SUCCESS [21.313s]
[INFO] hadoop-mapreduce-client-common .................... SUCCESS [24.412s]
[INFO] hadoop-mapreduce-client-shuffle ................... SUCCESS [1.662s]
[INFO] hadoop-mapreduce-client-app ....................... FAILURE [4:56.397s]
[INFO] hadoop-mapreduce-client-hs ........................ SKIPPED
[INFO] hadoop-mapreduce-client-jobclient ................. SKIPPED
[INFO] hadoop-mapreduce-client-hs-plugins ................ SKIPPED
[INFO] Apache Hadoop MapReduce Examples .................. SKIPPED
[INFO] hadoop-mapreduce .................................. SKIPPED
[INFO] ------------------------------------------------------------------------
[INFO] BUILD FAILURE
[INFO] ------------------------------------------------------------------------
[INFO] Total time: 5:46.035s
[INFO] Finished at: Sat Jan 12 13:21:27 UTC 2013
[INFO] Final Memory: 20M/211M
[INFO] ------------------------------------------------------------------------
[ERROR] Failed to execute goal org.apache.maven.plugins:maven-surefire-plugin:2.12.3:test
(default-test) on project hadoop-mapreduce-client-app: There are test failures.
[ERROR] 
[ERROR] Please refer to /home/jenkins/jenkins-slave/workspace/Hadoop-Mapreduce-trunk/trunk/hadoop-mapreduce-project/hadoop-mapreduce-client/hadoop-mapreduce-client-app/target/surefire-reports
for the individual test results.
[ERROR] -> [Help 1]
[ERROR] 
[ERROR] To see the full stack trace of the errors, re-run Maven with the -e switch.
[ERROR] Re-run Maven using the -X switch to enable full debug logging.
[ERROR] 
[ERROR] For more information about the errors and possible solutions, please read the following
articles:
[ERROR] [Help 1] http://cwiki.apache.org/confluence/display/MAVEN/MojoFailureException
[ERROR] 
[ERROR] After correcting the problems, you can resume the build with the command
[ERROR]   mvn <goals> -rf :hadoop-mapreduce-client-app
Build step 'Execute shell' marked build as failure
[FINDBUGS] Skipping publisher since build result is FAILURE
Archiving artifacts
Updating MAPREDUCE-4921
Updating HADOOP-9192
Updating HADOOP-9139
Updating HDFS-4384
Updating HDFS-4381
Updating HDFS-4274
Updating HDFS-4328
Email was triggered for: Failure
Sending email for trigger: Failure



###################################################################################
############################## FAILED TESTS (if any) ##############################
No tests ran.
Mime
  • Unnamed multipart/mixed (inline, None, 0 bytes)
View raw message