hadoop-mapreduce-dev mailing list archives

Site index · List index
Message view « Date » · « Thread »
Top « Date » · « Thread »
From Apache Jenkins Server <jenk...@builds.apache.org>
Subject Hadoop-Mapreduce-trunk - Build # 1325 - Still Failing
Date Sat, 26 Jan 2013 13:21:18 GMT
See https://builds.apache.org/job/Hadoop-Mapreduce-trunk/1325/

###################################################################################
########################## LAST 60 LINES OF THE CONSOLE ###########################
[...truncated 29179 lines...]
Running org.apache.hadoop.mapreduce.v2.hs.TestJobHistoryParsing
Tests run: 6, Failures: 0, Errors: 0, Skipped: 0, Time elapsed: 7.489 sec

Results :

Tests in error: 
  testHS(org.apache.hadoop.mapreduce.v2.hs.webapp.TestHsWebServices): Illegal repetition near
index 0(..)
  testHSSlash(org.apache.hadoop.mapreduce.v2.hs.webapp.TestHsWebServices): Illegal repetition
near index 0(..)
  testHSDefault(org.apache.hadoop.mapreduce.v2.hs.webapp.TestHsWebServices): Illegal repetition
near index 0(..)
  testHSXML(org.apache.hadoop.mapreduce.v2.hs.webapp.TestHsWebServices): Illegal repetition
near index 0(..)
  testInfo(org.apache.hadoop.mapreduce.v2.hs.webapp.TestHsWebServices): Illegal repetition
near index 0(..)
  testInfoSlash(org.apache.hadoop.mapreduce.v2.hs.webapp.TestHsWebServices): Illegal repetition
near index 0(..)
  testInfoDefault(org.apache.hadoop.mapreduce.v2.hs.webapp.TestHsWebServices): Illegal repetition
near index 0(..)
  testInfoXML(org.apache.hadoop.mapreduce.v2.hs.webapp.TestHsWebServices): Illegal repetition
near index 0(..)

Tests run: 128, Failures: 0, Errors: 8, Skipped: 0

[INFO] ------------------------------------------------------------------------
[INFO] Reactor Summary:
[INFO] 
[INFO] hadoop-mapreduce-client ........................... SUCCESS [1.620s]
[INFO] hadoop-mapreduce-client-core ...................... SUCCESS [22.119s]
[INFO] hadoop-mapreduce-client-common .................... SUCCESS [22.932s]
[INFO] hadoop-mapreduce-client-shuffle ................... SUCCESS [1.654s]
[INFO] hadoop-mapreduce-client-app ....................... SUCCESS [4:54.840s]
[INFO] hadoop-mapreduce-client-hs ........................ FAILURE [1:12.495s]
[INFO] hadoop-mapreduce-client-jobclient ................. SKIPPED
[INFO] hadoop-mapreduce-client-hs-plugins ................ SKIPPED
[INFO] Apache Hadoop MapReduce Examples .................. SKIPPED
[INFO] hadoop-mapreduce .................................. SKIPPED
[INFO] ------------------------------------------------------------------------
[INFO] BUILD FAILURE
[INFO] ------------------------------------------------------------------------
[INFO] Total time: 6:56.313s
[INFO] Finished at: Sat Jan 26 13:21:11 UTC 2013
[INFO] Final Memory: 20M/121M
[INFO] ------------------------------------------------------------------------
[ERROR] Failed to execute goal org.apache.maven.plugins:maven-surefire-plugin:2.12.3:test
(default-test) on project hadoop-mapreduce-client-hs: There are test failures.
[ERROR] 
[ERROR] Please refer to /home/jenkins/jenkins-slave/workspace/Hadoop-Mapreduce-trunk/trunk/hadoop-mapreduce-project/hadoop-mapreduce-client/hadoop-mapreduce-client-hs/target/surefire-reports
for the individual test results.
[ERROR] -> [Help 1]
[ERROR] 
[ERROR] To see the full stack trace of the errors, re-run Maven with the -e switch.
[ERROR] Re-run Maven using the -X switch to enable full debug logging.
[ERROR] 
[ERROR] For more information about the errors and possible solutions, please read the following
articles:
[ERROR] [Help 1] http://cwiki.apache.org/confluence/display/MAVEN/MojoFailureException
[ERROR] 
[ERROR] After correcting the problems, you can resume the build with the command
[ERROR]   mvn <goals> -rf :hadoop-mapreduce-client-hs
Build step 'Execute shell' marked build as failure
[FINDBUGS] Skipping publisher since build result is FAILURE
Archiving artifacts
Updating HADOOP-8857
Updating MAPREDUCE-4049
Updating HADOOP-9247
Updating HDFS-4443
Email was triggered for: Failure
Sending email for trigger: Failure



###################################################################################
############################## FAILED TESTS (if any) ##############################
No tests ran.
Mime
  • Unnamed multipart/mixed (inline, None, 0 bytes)
View raw message