hadoop-mapreduce-dev mailing list archives

Site index · List index
Message view « Date » · « Thread »
Top « Date » · « Thread »
From Apache Jenkins Server <jenk...@builds.apache.org>
Subject Hadoop-Mapreduce-trunk - Build # 1516 - Still Failing
Date Mon, 12 Aug 2013 13:04:12 GMT
See https://builds.apache.org/job/Hadoop-Mapreduce-trunk/1516/

###################################################################################
########################## LAST 60 LINES OF THE CONSOLE ###########################
[...truncated 9786 lines...]
[ERROR] symbol  : method setUnfinishedMessage(org.apache.hadoop.mapreduce.v2.proto.MRProtos.TaskIdProto)
[ERROR] location: class com.google.protobuf.InvalidProtocolBufferException
[ERROR] /home/jenkins/jenkins-slave/workspace/Hadoop-Mapreduce-trunk/trunk/hadoop-mapreduce-project/hadoop-mapreduce-client/hadoop-mapreduce-client-common/target/generated-sources/java/org/apache/hadoop/mapreduce/v2/proto/MRProtos.java:[1450,27]
cannot find symbol
[ERROR] symbol  : method setUnfinishedMessage(org.apache.hadoop.mapreduce.v2.proto.MRProtos.TaskIdProto)
[ERROR] location: class com.google.protobuf.InvalidProtocolBufferException
[ERROR] /home/jenkins/jenkins-slave/workspace/Hadoop-Mapreduce-trunk/trunk/hadoop-mapreduce-project/hadoop-mapreduce-client/hadoop-mapreduce-client-common/target/generated-sources/java/org/apache/hadoop/mapreduce/v2/proto/MRProtos.java:[1453,8]
cannot find symbol
[ERROR] symbol  : method makeExtensionsImmutable()
[ERROR] location: class org.apache.hadoop.mapreduce.v2.proto.MRProtos.TaskIdProto
[ERROR] /home/jenkins/jenkins-slave/workspace/Hadoop-Mapreduce-trunk/trunk/hadoop-mapreduce-project/hadoop-mapreduce-client/hadoop-mapreduce-client-common/target/generated-sources/java/org/apache/hadoop/mapreduce/v2/proto/MRProtos.java:[1464,10]
cannot find symbol
[ERROR] symbol  : method ensureFieldAccessorsInitialized(java.lang.Class<org.apache.hadoop.mapreduce.v2.proto.MRProtos.TaskIdProto>,java.lang.Class<org.apache.hadoop.mapreduce.v2.proto.MRProtos.TaskIdProto.Builder>)
[ERROR] location: class com.google.protobuf.GeneratedMessage.FieldAccessorTable
[ERROR] /home/jenkins/jenkins-slave/workspace/Hadoop-Mapreduce-trunk/trunk/hadoop-mapreduce-project/hadoop-mapreduce-client/hadoop-mapreduce-client-common/target/generated-sources/java/org/apache/hadoop/mapreduce/v2/proto/MRProtos.java:[1469,31]
cannot find symbol
[ERROR] symbol  : class AbstractParser
[ERROR] location: package com.google.protobuf
[ERROR] /home/jenkins/jenkins-slave/workspace/Hadoop-Mapreduce-trunk/trunk/hadoop-mapreduce-project/hadoop-mapreduce-client/hadoop-mapreduce-client-common/target/generated-sources/java/org/apache/hadoop/mapreduce/v2/proto/MRProtos.java:[1478,4]
method does not override or implement a method from a supertype
[ERROR] /home/jenkins/jenkins-slave/workspace/Hadoop-Mapreduce-trunk/trunk/hadoop-mapreduce-project/hadoop-mapreduce-client/hadoop-mapreduce-client-common/target/generated-sources/java/org/apache/hadoop/mapreduce/v2/proto/MRProtos.java:[1733,12]
cannot find symbol
[ERROR] symbol  : method ensureFieldAccessorsInitialized(java.lang.Class<org.apache.hadoop.mapreduce.v2.proto.MRProtos.TaskIdProto>,java.lang.Class<org.apache.hadoop.mapreduce.v2.proto.MRProtos.TaskIdProto.Builder>)
[ERROR] location: class com.google.protobuf.GeneratedMessage.FieldAccessorTable
[ERROR] /home/jenkins/jenkins-slave/workspace/Hadoop-Mapreduce-trunk/trunk/hadoop-mapreduce-project/hadoop-mapreduce-client/hadoop-mapreduce-client-common/target/generated-sources/java/org/apache/hadoop/mapreduce/v2/proto/MRProtos.java:[1853,87]
cannot find symbol
[ERROR] symbol  : method getUnfinishedMessage()
[ERROR] location: class com.google.protobuf.InvalidProtocolBufferException
[ERROR] /home/jenkins/jenkins-slave/workspace/Hadoop-Mapreduce-trunk/trunk/hadoop-mapreduce-project/hadoop-mapreduce-client/hadoop-mapreduce-client-common/target/generated-sources/java/org/apache/hadoop/mapreduce/v2/proto/MRProtos.java:[2113,8]
getUnknownFields() in org.apache.hadoop.mapreduce.v2.proto.MRProtos.TaskAttemptIdProto cannot
override getUnknownFields() in com.google.protobuf.GeneratedMessage; overridden method is
final
[ERROR] /home/jenkins/jenkins-slave/workspace/Hadoop-Mapreduce-trunk/trunk/hadoop-mapreduce-project/hadoop-mapreduce-client/hadoop-mapreduce-client-common/target/generated-sources/java/org/apache/hadoop/mapreduce/v2/proto/MRProtos.java:[2133,19]
cannot find symbol
[ERROR] symbol  : method parseUnknownField(com.google.protobuf.CodedInputStream,com.google.protobuf.UnknownFieldSet.Builder,com.google.protobuf.ExtensionRegistryLite,int)
[ERROR] location: class org.apache.hadoop.mapreduce.v2.proto.MRProtos.TaskAttemptIdProto
[ERROR] /home/jenkins/jenkins-slave/workspace/Hadoop-Mapreduce-trunk/trunk/hadoop-mapreduce-project/hadoop-mapreduce-client/hadoop-mapreduce-client-common/target/generated-sources/java/org/apache/hadoop/mapreduce/v2/proto/MRProtos.java:[2160,15]
cannot find symbol
[ERROR] symbol  : method setUnfinishedMessage(org.apache.hadoop.mapreduce.v2.proto.MRProtos.TaskAttemptIdProto)
[ERROR] location: class com.google.protobuf.InvalidProtocolBufferException
[ERROR] /home/jenkins/jenkins-slave/workspace/Hadoop-Mapreduce-trunk/trunk/hadoop-mapreduce-project/hadoop-mapreduce-client/hadoop-mapreduce-client-common/target/generated-sources/java/org/apache/hadoop/mapreduce/v2/proto/MRProtos.java:[2163,27]
cannot find symbol
[ERROR] symbol  : method setUnfinishedMessage(org.apache.hadoop.mapreduce.v2.proto.MRProtos.TaskAttemptIdProto)
[ERROR] location: class com.google.protobuf.InvalidProtocolBufferException
[ERROR] /home/jenkins/jenkins-slave/workspace/Hadoop-Mapreduce-trunk/trunk/hadoop-mapreduce-project/hadoop-mapreduce-client/hadoop-mapreduce-client-common/target/generated-sources/java/org/apache/hadoop/mapreduce/v2/proto/MRProtos.java:[2166,8]
cannot find symbol
[ERROR] symbol  : method makeExtensionsImmutable()
[ERROR] location: class org.apache.hadoop.mapreduce.v2.proto.MRProtos.TaskAttemptIdProto
[ERROR] /home/jenkins/jenkins-slave/workspace/Hadoop-Mapreduce-trunk/trunk/hadoop-mapreduce-project/hadoop-mapreduce-client/hadoop-mapreduce-client-common/target/generated-sources/java/org/apache/hadoop/mapreduce/v2/proto/MRProtos.java:[2177,10]
cannot find symbol
[ERROR] symbol  : method ensureFieldAccessorsInitialized(java.lang.Class<org.apache.hadoop.mapreduce.v2.proto.MRProtos.TaskAttemptIdProto>,java.lang.Class<org.apache.hadoop.mapreduce.v2.proto.MRProtos.TaskAttemptIdProto.Builder>)
[ERROR] location: class com.google.protobuf.GeneratedMessage.FieldAccessorTable
[ERROR] /home/jenkins/jenkins-slave/workspace/Hadoop-Mapreduce-trunk/trunk/hadoop-mapreduce-project/hadoop-mapreduce-client/hadoop-mapreduce-client-common/target/generated-sources/java/org/apache/hadoop/mapreduce/v2/proto/MRProtos.java:[2182,31]
cannot find symbol
[ERROR] symbol  : class AbstractParser
[ERROR] location: package com.google.protobuf
[ERROR] /home/jenkins/jenkins-slave/workspace/Hadoop-Mapreduce-trunk/trunk/hadoop-mapreduce-project/hadoop-mapreduce-client/hadoop-mapreduce-client-common/target/generated-sources/java/org/apache/hadoop/mapreduce/v2/proto/MRProtos.java:[2191,4]
method does not override or implement a method from a supertype
[ERROR] /home/jenkins/jenkins-slave/workspace/Hadoop-Mapreduce-trunk/trunk/hadoop-mapreduce-project/hadoop-mapreduce-client/hadoop-mapreduce-client-common/target/generated-sources/java/org/apache/hadoop/mapreduce/v2/proto/MRProtos.java:[2413,12]
cannot find symbol
[ERROR] symbol  : method ensureFieldAccessorsInitialized(java.lang.Class<org.apache.hadoop.mapreduce.v2.proto.MRProtos.TaskAttemptIdProto>,java.lang.Class<org.apache.hadoop.mapreduce.v2.proto.MRProtos.TaskAttemptIdProto.Builder>)
[ERROR] location: class com.google.protobuf.GeneratedMessage.FieldAccessorTable
[ERROR] -> [Help 1]
[ERROR] 
[ERROR] To see the full stack trace of the errors, re-run Maven with the -e switch.
[ERROR] Re-run Maven using the -X switch to enable full debug logging.
[ERROR] 
[ERROR] For more information about the errors and possible solutions, please read the following
articles:
[ERROR] [Help 1] http://cwiki.apache.org/confluence/display/MAVEN/MojoFailureException
[ERROR] 
[ERROR] After correcting the problems, you can resume the build with the command
[ERROR]   mvn <goals> -rf :hadoop-mapreduce-client-common
Build step 'Execute shell' marked build as failure
[FINDBUGS] Skipping publisher since build result is FAILURE
Archiving artifacts
Email was triggered for: Failure
Sending email for trigger: Failure



###################################################################################
############################## FAILED TESTS (if any) ##############################
No tests ran.
Mime
  • Unnamed multipart/mixed (inline, None, 0 bytes)
View raw message