hadoop-mapreduce-dev mailing list archives

Site index · List index
Message view « Date » · « Thread »
Top « Date » · « Thread »
From Apache Jenkins Server <jenk...@builds.apache.org>
Subject Hadoop-Mapreduce-trunk - Build # 1506 - Failure
Date Fri, 02 Aug 2013 13:25:21 GMT
See https://builds.apache.org/job/Hadoop-Mapreduce-trunk/1506/

###################################################################################
########################## LAST 60 LINES OF THE CONSOLE ###########################
[...truncated 30138 lines...]
Running org.apache.hadoop.mapreduce.v2.hs.webapp.TestBlocks
Tests run: 4, Failures: 0, Errors: 0, Skipped: 0, Time elapsed: 1.144 sec
Running org.apache.hadoop.mapreduce.v2.hs.webapp.TestHsWebServices
Tests run: 11, Failures: 0, Errors: 0, Skipped: 0, Time elapsed: 5.606 sec
Running org.apache.hadoop.mapreduce.v2.hs.TestJobHistoryEntities
Tests run: 8, Failures: 0, Errors: 0, Skipped: 0, Time elapsed: 2.203 sec
Running org.apache.hadoop.mapreduce.v2.hs.TestJobListCache
Tests run: 2, Failures: 0, Errors: 0, Skipped: 0, Time elapsed: 0.472 sec
Running org.apache.hadoop.mapreduce.v2.hs.TestJobHistoryParsing
Tests run: 9, Failures: 0, Errors: 0, Skipped: 0, Time elapsed: 9.924 sec
Running org.apache.hadoop.mapreduce.v2.hs.TestJobIdHistoryFileInfoMap
Tests run: 1, Failures: 0, Errors: 0, Skipped: 0, Time elapsed: 0.448 sec

Results :

Tests run: 152, Failures: 0, Errors: 0, Skipped: 0

[INFO] ------------------------------------------------------------------------
[INFO] Reactor Summary:
[INFO] 
[INFO] hadoop-mapreduce-client ........................... SUCCESS [1.861s]
[INFO] hadoop-mapreduce-client-core ...................... SUCCESS [38.185s]
[INFO] hadoop-mapreduce-client-common .................... SUCCESS [23.878s]
[INFO] hadoop-mapreduce-client-shuffle ................... SUCCESS [2.272s]
[INFO] hadoop-mapreduce-client-app ....................... SUCCESS [5:44.484s]
[INFO] hadoop-mapreduce-client-hs ........................ FAILURE [1:36.002s]
[INFO] hadoop-mapreduce-client-jobclient ................. SKIPPED
[INFO] hadoop-mapreduce-client-hs-plugins ................ SKIPPED
[INFO] Apache Hadoop MapReduce Examples .................. SKIPPED
[INFO] hadoop-mapreduce .................................. SKIPPED
[INFO] ------------------------------------------------------------------------
[INFO] BUILD FAILURE
[INFO] ------------------------------------------------------------------------
[INFO] Total time: 8:27.315s
[INFO] Finished at: Fri Aug 02 13:25:15 UTC 2013
[INFO] Final Memory: 21M/225M
[INFO] ------------------------------------------------------------------------
[ERROR] Failed to execute goal org.apache.maven.plugins:maven-surefire-plugin:2.12.3:test
(default-test) on project hadoop-mapreduce-client-hs: ExecutionException; nested exception
is java.util.concurrent.ExecutionException: java.lang.RuntimeException: The forked VM terminated
without saying properly goodbye. VM crash or System.exit called ? -> [Help 1]
[ERROR] 
[ERROR] To see the full stack trace of the errors, re-run Maven with the -e switch.
[ERROR] Re-run Maven using the -X switch to enable full debug logging.
[ERROR] 
[ERROR] For more information about the errors and possible solutions, please read the following
articles:
[ERROR] [Help 1] http://cwiki.apache.org/confluence/display/MAVEN/MojoExecutionException
[ERROR] 
[ERROR] After correcting the problems, you can resume the build with the command
[ERROR]   mvn <goals> -rf :hadoop-mapreduce-client-hs
Build step 'Execute shell' marked build as failure
[FINDBUGS] Skipping publisher since build result is FAILURE
Archiving artifacts
Updating YARN-573
Updating YARN-903
Updating MAPREDUCE-5428
Updating HADOOP-9806
Updating MAPREDUCE-5352
Updating HDFS-5028
Updating HADOOP-9801
Email was triggered for: Failure
Sending email for trigger: Failure



###################################################################################
############################## FAILED TESTS (if any) ##############################
No tests ran.
Mime
  • Unnamed multipart/mixed (inline, None, 0 bytes)
View raw message