hadoop-mapreduce-dev mailing list archives

Site index · List index
Message view « Date » · « Thread »
Top « Date » · « Thread »
From Apache Jenkins Server <jenk...@builds.apache.org>
Subject Hadoop-Mapreduce-trunk - Build # 1531 - Still Failing
Date Tue, 27 Aug 2013 14:40:17 GMT
See https://builds.apache.org/job/Hadoop-Mapreduce-trunk/1531/

###################################################################################
########################## LAST 60 LINES OF THE CONSOLE ###########################
[...truncated 31919 lines...]
Tests run: 4, Failures: 0, Errors: 0, Skipped: 0, Time elapsed: 1.09 sec
Running org.apache.hadoop.mapreduce.lib.partition.TestMRKeyFieldBasedComparator
Tests run: 1, Failures: 0, Errors: 0, Skipped: 0, Time elapsed: 17.066 sec
Running org.apache.hadoop.mapreduce.lib.partition.TestKeyFieldHelper
Tests run: 3, Failures: 0, Errors: 0, Skipped: 0, Time elapsed: 0.139 sec
Running org.apache.hadoop.mapreduce.lib.partition.TestBinaryPartitioner
Tests run: 4, Failures: 0, Errors: 0, Skipped: 0, Time elapsed: 0.476 sec
Running org.apache.hadoop.mapreduce.lib.partition.TestMRKeyFieldBasedPartitioner
Tests run: 1, Failures: 0, Errors: 0, Skipped: 0, Time elapsed: 0.422 sec
Running org.apache.hadoop.mapreduce.TestChild
Tests run: 1, Failures: 0, Errors: 0, Skipped: 0, Time elapsed: 61.623 sec
Running org.apache.hadoop.mapreduce.filecache.TestURIFragments
Tests run: 1, Failures: 0, Errors: 0, Skipped: 0, Time elapsed: 0.064 sec
Running org.apache.hadoop.mapreduce.TestMapReduce
Tests run: 1, Failures: 0, Errors: 0, Skipped: 0, Time elapsed: 8.414 sec

Results :

Tests run: 466, Failures: 0, Errors: 0, Skipped: 11

[INFO] ------------------------------------------------------------------------
[INFO] Reactor Summary:
[INFO] 
[INFO] hadoop-mapreduce-client ........................... SUCCESS [1.764s]
[INFO] hadoop-mapreduce-client-core ...................... SUCCESS [38.475s]
[INFO] hadoop-mapreduce-client-common .................... SUCCESS [23.902s]
[INFO] hadoop-mapreduce-client-shuffle ................... SUCCESS [2.314s]
[INFO] hadoop-mapreduce-client-app ....................... SUCCESS [5:52.425s]
[INFO] hadoop-mapreduce-client-hs ........................ SUCCESS [1:37.665s]
[INFO] hadoop-mapreduce-client-jobclient ................. FAILURE [1:13:43.446s]
[INFO] hadoop-mapreduce-client-hs-plugins ................ SKIPPED
[INFO] Apache Hadoop MapReduce Examples .................. SKIPPED
[INFO] hadoop-mapreduce .................................. SKIPPED
[INFO] ------------------------------------------------------------------------
[INFO] BUILD FAILURE
[INFO] ------------------------------------------------------------------------
[INFO] Total time: 1:22:20.663s
[INFO] Finished at: Tue Aug 27 14:40:02 UTC 2013
[INFO] Final Memory: 40M/103M
[INFO] ------------------------------------------------------------------------
[ERROR] Failed to execute goal org.apache.maven.plugins:maven-surefire-plugin:2.12.3:test
(default-test) on project hadoop-mapreduce-client-jobclient: ExecutionException; nested exception
is java.util.concurrent.ExecutionException: java.lang.RuntimeException: The forked VM terminated
without saying properly goodbye. VM crash or System.exit called ? -> [Help 1]
[ERROR] 
[ERROR] To see the full stack trace of the errors, re-run Maven with the -e switch.
[ERROR] Re-run Maven using the -X switch to enable full debug logging.
[ERROR] 
[ERROR] For more information about the errors and possible solutions, please read the following
articles:
[ERROR] [Help 1] http://cwiki.apache.org/confluence/display/MAVEN/MojoExecutionException
[ERROR] 
[ERROR] After correcting the problems, you can resume the build with the command
[ERROR]   mvn <goals> -rf :hadoop-mapreduce-client-jobclient
Build step 'Execute shell' marked build as failure
[FINDBUGS] Skipping publisher since build result is FAILURE
Archiving artifacts
Updating YARN-942
Updating YARN-1093
Updating YARN-1008
Updating YARN-1085
Email was triggered for: Failure
Sending email for trigger: Failure



###################################################################################
############################## FAILED TESTS (if any) ##############################
No tests ran.
Mime
  • Unnamed multipart/mixed (inline, None, 0 bytes)
View raw message