hadoop-mapreduce-dev mailing list archives

Site index · List index
Message view « Date » · « Thread »
Top « Date » · « Thread »
From Apache Jenkins Server <jenk...@builds.apache.org>
Subject Hadoop-Mapreduce-trunk - Build # 1518 - Still Failing
Date Wed, 14 Aug 2013 14:26:13 GMT
See https://builds.apache.org/job/Hadoop-Mapreduce-trunk/1518/

###################################################################################
########################## LAST 60 LINES OF THE CONSOLE ###########################
[...truncated 31864 lines...]
Running org.apache.hadoop.mapred.TestClientRedirect
Tests run: 1, Failures: 0, Errors: 0, Skipped: 0, Time elapsed: 12.508 sec
Running org.apache.hadoop.mapred.TestWritableJobConf
Tests run: 3, Failures: 0, Errors: 0, Skipped: 0, Time elapsed: 0.692 sec
Running org.apache.hadoop.mapred.TestReduceFetchFromPartialMem
Tests run: 1, Failures: 0, Errors: 0, Skipped: 0, Time elapsed: 31.152 sec
Running org.apache.hadoop.mapred.TestCollect
Tests run: 1, Failures: 0, Errors: 0, Skipped: 0, Time elapsed: 2.803 sec
Running org.apache.hadoop.util.TestRunJar
Tests run: 1, Failures: 0, Errors: 0, Skipped: 0, Time elapsed: 0.331 sec
Running org.apache.hadoop.util.TestReflectionUtils
Tests run: 1, Failures: 0, Errors: 0, Skipped: 0, Time elapsed: 0.34 sec
Running org.apache.hadoop.io.TestSequenceFileMergeProgress
Tests run: 3, Failures: 0, Errors: 0, Skipped: 0, Time elapsed: 1.829 sec

Results :

Tests run: 466, Failures: 0, Errors: 0, Skipped: 11

[INFO] ------------------------------------------------------------------------
[INFO] Reactor Summary:
[INFO] 
[INFO] hadoop-mapreduce-client ........................... SUCCESS [1.754s]
[INFO] hadoop-mapreduce-client-core ...................... SUCCESS [38.542s]
[INFO] hadoop-mapreduce-client-common .................... SUCCESS [24.202s]
[INFO] hadoop-mapreduce-client-shuffle ................... SUCCESS [2.316s]
[INFO] hadoop-mapreduce-client-app ....................... SUCCESS [5:45.308s]
[INFO] hadoop-mapreduce-client-hs ........................ SUCCESS [1:36.357s]
[INFO] hadoop-mapreduce-client-jobclient ................. FAILURE [58:37.052s]
[INFO] hadoop-mapreduce-client-hs-plugins ................ SKIPPED
[INFO] Apache Hadoop MapReduce Examples .................. SKIPPED
[INFO] hadoop-mapreduce .................................. SKIPPED
[INFO] ------------------------------------------------------------------------
[INFO] BUILD FAILURE
[INFO] ------------------------------------------------------------------------
[INFO] Total time: 1:07:06.174s
[INFO] Finished at: Wed Aug 14 14:26:04 UTC 2013
[INFO] Final Memory: 40M/119M
[INFO] ------------------------------------------------------------------------
[ERROR] Failed to execute goal org.apache.maven.plugins:maven-surefire-plugin:2.12.3:test
(default-test) on project hadoop-mapreduce-client-jobclient: ExecutionException; nested exception
is java.util.concurrent.ExecutionException: java.lang.RuntimeException: The forked VM terminated
without saying properly goodbye. VM crash or System.exit called ? -> [Help 1]
[ERROR] 
[ERROR] To see the full stack trace of the errors, re-run Maven with the -e switch.
[ERROR] Re-run Maven using the -X switch to enable full debug logging.
[ERROR] 
[ERROR] For more information about the errors and possible solutions, please read the following
articles:
[ERROR] [Help 1] http://cwiki.apache.org/confluence/display/MAVEN/MojoExecutionException
[ERROR] 
[ERROR] After correcting the problems, you can resume the build with the command
[ERROR]   mvn <goals> -rf :hadoop-mapreduce-client-jobclient
Build step 'Execute shell' marked build as failure
[FINDBUGS] Skipping publisher since build result is FAILURE
Archiving artifacts
Updating HADOOP-9740
Updating HDFS-5091
Updating HADOOP-9848
Updating YARN-1060
Updating HADOOP-9446
Email was triggered for: Failure
Sending email for trigger: Failure



###################################################################################
############################## FAILED TESTS (if any) ##############################
No tests ran.
Mime
  • Unnamed multipart/mixed (inline, None, 0 bytes)
View raw message