hadoop-mapreduce-dev mailing list archives

Site index · List index
Message view « Date » · « Thread »
Top « Date » · « Thread »
From Apache Jenkins Server <jenk...@builds.apache.org>
Subject Hadoop-Mapreduce-trunk - Build # 1520 - Still Failing
Date Fri, 16 Aug 2013 14:44:51 GMT
See https://builds.apache.org/job/Hadoop-Mapreduce-trunk/1520/

###################################################################################
########################## LAST 60 LINES OF THE CONSOLE ###########################
[...truncated 31878 lines...]
Running org.apache.hadoop.mapreduce.TestChild
Tests run: 1, Failures: 0, Errors: 0, Skipped: 0, Time elapsed: 55.132 sec
Running org.apache.hadoop.mapreduce.filecache.TestURIFragments
Tests run: 1, Failures: 0, Errors: 0, Skipped: 0, Time elapsed: 0.063 sec
Running org.apache.hadoop.mapreduce.TestMapReduce
Tests run: 1, Failures: 0, Errors: 0, Skipped: 0, Time elapsed: 9.431 sec

Results :

Tests run: 466, Failures: 0, Errors: 0, Skipped: 11

[INFO] ------------------------------------------------------------------------
[INFO] Reactor Summary:
[INFO] 
[INFO] hadoop-mapreduce-client ........................... SUCCESS [1.757s]
[INFO] hadoop-mapreduce-client-core ...................... SUCCESS [38.401s]
[INFO] hadoop-mapreduce-client-common .................... SUCCESS [25.178s]
[INFO] hadoop-mapreduce-client-shuffle ................... SUCCESS [2.337s]
[INFO] hadoop-mapreduce-client-app ....................... SUCCESS [5:46.387s]
[INFO] hadoop-mapreduce-client-hs ........................ SUCCESS [1:37.551s]
[INFO] hadoop-mapreduce-client-jobclient ................. FAILURE [1:17:49.348s]
[INFO] hadoop-mapreduce-client-hs-plugins ................ SKIPPED
[INFO] Apache Hadoop MapReduce Examples .................. SKIPPED
[INFO] hadoop-mapreduce .................................. SKIPPED
[INFO] ------------------------------------------------------------------------
[INFO] BUILD FAILURE
[INFO] ------------------------------------------------------------------------
[INFO] Total time: 1:26:21.601s
[INFO] Finished at: Fri Aug 16 14:44:42 UTC 2013
[INFO] Final Memory: 39M/120M
[INFO] ------------------------------------------------------------------------
[ERROR] Failed to execute goal org.apache.maven.plugins:maven-surefire-plugin:2.12.3:test
(default-test) on project hadoop-mapreduce-client-jobclient: ExecutionException; nested exception
is java.util.concurrent.ExecutionException: java.lang.RuntimeException: The forked VM terminated
without saying properly goodbye. VM crash or System.exit called ? -> [Help 1]
[ERROR] 
[ERROR] To see the full stack trace of the errors, re-run Maven with the -e switch.
[ERROR] Re-run Maven using the -X switch to enable full debug logging.
[ERROR] 
[ERROR] For more information about the errors and possible solutions, please read the following
articles:
[ERROR] [Help 1] http://cwiki.apache.org/confluence/display/MAVEN/MojoExecutionException
[ERROR] 
[ERROR] After correcting the problems, you can resume the build with the command
[ERROR]   mvn <goals> -rf :hadoop-mapreduce-client-jobclient
Build step 'Execute shell' marked build as failure
[FINDBUGS] Skipping publisher since build result is FAILURE
Archiving artifacts
Updating HDFS-5080
Updating HDFS-2994
Updating HADOOP-9868
Updating HDFS-5004
Updating YARN-1045
Updating MAPREDUCE-5462
Updating HDFS-5099
Updating HDFS-5093
Updating HADOOP-9865
Updating HDFS-5076
Updating HDFS-5103
Updating HDFS-5100
Updating MAPREDUCE-5352
Email was triggered for: Failure
Sending email for trigger: Failure



###################################################################################
############################## FAILED TESTS (if any) ##############################
No tests ran.
Mime
  • Unnamed multipart/mixed (inline, None, 0 bytes)
View raw message