hadoop-mapreduce-dev mailing list archives

Site index · List index
Message view « Date » · « Thread »
Top « Date » · « Thread »
From Apache Jenkins Server <jenk...@builds.apache.org>
Subject Hadoop-Mapreduce-trunk - Build # 1549 - Still Failing
Date Sun, 15 Sep 2013 14:15:49 GMT
See https://builds.apache.org/job/Hadoop-Mapreduce-trunk/1549/

###################################################################################
########################## LAST 60 LINES OF THE CONSOLE ###########################
[...truncated 32662 lines...]
# Cannot create GC thread. Out of system resources.
# An error report file with more information is saved as:
# /home/jenkins/jenkins-slave/workspace/Hadoop-Mapreduce-trunk/trunk/hadoop-mapreduce-project/hadoop-mapreduce-client/hadoop-mapreduce-client-jobclient/hs_err_pid15596.log

Results :

Failed tests: 
  TestJobCounters.testHeapUsageCounter:678->runHeapUsageTestJob:632 Job job_1379251697122_0001
failed!

Tests in error: 
  TestMiniMRClasspath.testClassPath:175 » YarnRuntime java.lang.OutOfMemoryError...
  TestMiniMRClasspath.testExternalWritable:207 » YarnRuntime java.lang.OutOfMemo...
  TestMiniMRWithDFSWithDistinctUsers.setUp:97 » YarnRuntime java.lang.OutOfMemor...
  TestMiniMRWithDFSWithDistinctUsers.setUp:97 » YarnRuntime java.lang.OutOfMemor...
  TestClusterMRNotification>NotificationTestCase.testMR:156->NotificationTestCase.launchWordCount:241
» IO
  TestReduceFetchFromPartialMem.testReduceFromPartialMem » Remote File /tmp/hado...

Tests run: 83, Failures: 1, Errors: 5, Skipped: 2

[INFO] ------------------------------------------------------------------------
[INFO] Reactor Summary:
[INFO] 
[INFO] hadoop-mapreduce-client ........................... SUCCESS [1.774s]
[INFO] hadoop-mapreduce-client-core ...................... SUCCESS [37.809s]
[INFO] hadoop-mapreduce-client-common .................... SUCCESS [27.024s]
[INFO] hadoop-mapreduce-client-shuffle ................... SUCCESS [2.319s]
[INFO] hadoop-mapreduce-client-app ....................... SUCCESS [6:20.194s]
[INFO] hadoop-mapreduce-client-hs ........................ SUCCESS [1:43.360s]
[INFO] hadoop-mapreduce-client-jobclient ................. FAILURE [49:03.095s]
[INFO] hadoop-mapreduce-client-hs-plugins ................ SKIPPED
[INFO] Apache Hadoop MapReduce Examples .................. SKIPPED
[INFO] hadoop-mapreduce .................................. SKIPPED
[INFO] ------------------------------------------------------------------------
[INFO] BUILD FAILURE
[INFO] ------------------------------------------------------------------------
[INFO] Total time: 58:16.215s
[INFO] Finished at: Sun Sep 15 14:15:45 UTC 2013
[INFO] Final Memory: 21M/80M
[INFO] ------------------------------------------------------------------------
[ERROR] Failed to execute goal org.apache.maven.plugins:maven-surefire-plugin:2.16:test (default-test)
on project hadoop-mapreduce-client-jobclient: ExecutionException; nested exception is java.util.concurrent.ExecutionException:
java.lang.RuntimeException: The forked VM terminated without saying properly goodbye. VM crash
or System.exit called ?
[ERROR] Command was/bin/sh -c cd /home/jenkins/jenkins-slave/workspace/Hadoop-Mapreduce-trunk/trunk/hadoop-mapreduce-project/hadoop-mapreduce-client/hadoop-mapreduce-client-jobclient
&& /home/jenkins/tools/java/jdk1.6.0_26/jre/bin/java -Xmx1024m -XX:+HeapDumpOnOutOfMemoryError
-jar /home/jenkins/jenkins-slave/workspace/Hadoop-Mapreduce-trunk/trunk/hadoop-mapreduce-project/hadoop-mapreduce-client/hadoop-mapreduce-client-jobclient/target/surefire/surefirebooter6545444847807522189.jar
/home/jenkins/jenkins-slave/workspace/Hadoop-Mapreduce-trunk/trunk/hadoop-mapreduce-project/hadoop-mapreduce-client/hadoop-mapreduce-client-jobclient/target/surefire/surefire7899631005295527387tmp
/home/jenkins/jenkins-slave/workspace/Hadoop-Mapreduce-trunk/trunk/hadoop-mapreduce-project/hadoop-mapreduce-client/hadoop-mapreduce-client-jobclient/target/surefire/surefire_1081681608169084392686tmp
[ERROR] -> [Help 1]
[ERROR] 
[ERROR] To see the full stack trace of the errors, re-run Maven with the -e switch.
[ERROR] Re-run Maven using the -X switch to enable full debug logging.
[ERROR] 
[ERROR] For more information about the errors and possible solutions, please read the following
articles:
[ERROR] [Help 1] http://cwiki.apache.org/confluence/display/MAVEN/MojoFailureException
[ERROR] 
[ERROR] After correcting the problems, you can resume the build with the command
[ERROR]   mvn <goals> -rf :hadoop-mapreduce-client-jobclient
Build step 'Execute shell' marked build as failure
[FINDBUGS] Skipping publisher since build result is FAILURE
Archiving artifacts
Updating HADOOP-9935
Updating HDFS-5188
Updating YARN-540
Email was triggered for: Failure
Sending email for trigger: Failure



###################################################################################
############################## FAILED TESTS (if any) ##############################
No tests ran.
Mime
  • Unnamed multipart/mixed (inline, None, 0 bytes)
View raw message