hadoop-mapreduce-dev mailing list archives

Site index · List index
Message view « Date » · « Thread »
Top « Date » · « Thread »
From Apache Jenkins Server <jenk...@builds.apache.org>
Subject Hadoop-Mapreduce-trunk - Build # 1550 - Still Failing
Date Mon, 16 Sep 2013 14:14:27 GMT
See https://builds.apache.org/job/Hadoop-Mapreduce-trunk/1550/

###################################################################################
########################## LAST 60 LINES OF THE CONSOLE ###########################
[...truncated 33559 lines...]
Tests in error: 
  TestMiniMRClasspath.testClassPath:175 » YarnRuntime java.lang.OutOfMemoryError...
  TestMiniMRClasspath.testExternalWritable:207 » YarnRuntime java.lang.OutOfMemo...
  TestClusterMapReduceTestCase>ClusterMapReduceTestCase.setUp:56->ClusterMapReduceTestCase.startCluster:86
» YarnRuntime
  TestClusterMapReduceTestCase>ClusterMapReduceTestCase.setUp:56->ClusterMapReduceTestCase.startCluster:86
» YarnRuntime
  TestClusterMapReduceTestCase>ClusterMapReduceTestCase.setUp:56->ClusterMapReduceTestCase.startCluster:86
» YarnRuntime
  TestClusterMapReduceTestCase>ClusterMapReduceTestCase.setUp:56->ClusterMapReduceTestCase.startCluster:86
» YarnRuntime
  TestMiniMRWithDFSWithDistinctUsers.setUp:97 » YarnRuntime java.lang.OutOfMemor...
  TestMiniMRWithDFSWithDistinctUsers.setUp:97 » YarnRuntime java.lang.OutOfMemor...
  TestClusterMRNotification>NotificationTestCase.testMR:156->NotificationTestCase.launchWordCount:241
» IO
  TestReduceFetchFromPartialMem$1>TestSetup.run:27->setUp:61 » YarnRuntime java....
  TestJobSysDirWithDFS.testWithDFS:130 » YarnRuntime java.lang.OutOfMemoryError:...
  TestComparators.testUserMRComparator:365->configure:301 » OutOfMemory unable t...
  TestComparators.testUserValueGroupingComparator:388->configure:301 » OutOfMemory
  TestComparators.testAllUserComparators:413->configure:301 » OutOfMemory unable...

Tests run: 131, Failures: 5, Errors: 14, Skipped: 4

[INFO] ------------------------------------------------------------------------
[INFO] Reactor Summary:
[INFO] 
[INFO] hadoop-mapreduce-client ........................... SUCCESS [2.510s]
[INFO] hadoop-mapreduce-client-core ...................... SUCCESS [38.586s]
[INFO] hadoop-mapreduce-client-common .................... SUCCESS [26.914s]
[INFO] hadoop-mapreduce-client-shuffle ................... SUCCESS [2.397s]
[INFO] hadoop-mapreduce-client-app ....................... SUCCESS [6:27.903s]
[INFO] hadoop-mapreduce-client-hs ........................ SUCCESS [1:44.484s]
[INFO] hadoop-mapreduce-client-jobclient ................. FAILURE [47:24.360s]
[INFO] hadoop-mapreduce-client-hs-plugins ................ SKIPPED
[INFO] Apache Hadoop MapReduce Examples .................. SKIPPED
[INFO] hadoop-mapreduce .................................. SKIPPED
[INFO] ------------------------------------------------------------------------
[INFO] BUILD FAILURE
[INFO] ------------------------------------------------------------------------
[INFO] Total time: 56:47.826s
[INFO] Finished at: Mon Sep 16 14:14:22 UTC 2013
[INFO] Final Memory: 23M/120M
[INFO] ------------------------------------------------------------------------
[ERROR] Failed to execute goal org.apache.maven.plugins:maven-surefire-plugin:2.16:test (default-test)
on project hadoop-mapreduce-client-jobclient: ExecutionException; nested exception is java.util.concurrent.ExecutionException:
java.lang.RuntimeException: The forked VM terminated without saying properly goodbye. VM crash
or System.exit called ?
[ERROR] Command was/bin/sh -c cd /home/jenkins/jenkins-slave/workspace/Hadoop-Mapreduce-trunk/trunk/hadoop-mapreduce-project/hadoop-mapreduce-client/hadoop-mapreduce-client-jobclient
&& /home/jenkins/tools/java/jdk1.6.0_26/jre/bin/java -Xmx1024m -XX:+HeapDumpOnOutOfMemoryError
-jar /home/jenkins/jenkins-slave/workspace/Hadoop-Mapreduce-trunk/trunk/hadoop-mapreduce-project/hadoop-mapreduce-client/hadoop-mapreduce-client-jobclient/target/surefire/surefirebooter2430301328563326560.jar
/home/jenkins/jenkins-slave/workspace/Hadoop-Mapreduce-trunk/trunk/hadoop-mapreduce-project/hadoop-mapreduce-client/hadoop-mapreduce-client-jobclient/target/surefire/surefire7176694833916434635tmp
/home/jenkins/jenkins-slave/workspace/Hadoop-Mapreduce-trunk/trunk/hadoop-mapreduce-project/hadoop-mapreduce-client/hadoop-mapreduce-client-jobclient/target/surefire/surefire_1464450613489955468248tmp
[ERROR] -> [Help 1]
[ERROR] 
[ERROR] To see the full stack trace of the errors, re-run Maven with the -e switch.
[ERROR] Re-run Maven using the -X switch to enable full debug logging.
[ERROR] 
[ERROR] For more information about the errors and possible solutions, please read the following
articles:
[ERROR] [Help 1] http://cwiki.apache.org/confluence/display/MAVEN/MojoFailureException
[ERROR] 
[ERROR] After correcting the problems, you can resume the build with the command
[ERROR]   mvn <goals> -rf :hadoop-mapreduce-client-jobclient
Build step 'Execute shell' marked build as failure
[FINDBUGS] Skipping publisher since build result is FAILURE
Archiving artifacts
Updating YARN-1137
Updating HADOOP-9962
Updating HADOOP-9961
Updating MAPREDUCE-5379
Email was triggered for: Failure
Sending email for trigger: Failure



###################################################################################
############################## FAILED TESTS (if any) ##############################
No tests ran.
Mime
  • Unnamed multipart/mixed (inline, None, 0 bytes)
View raw message