hadoop-mapreduce-dev mailing list archives

Site index · List index
Message view « Date » · « Thread »
Top « Date » · « Thread »
From Apache Jenkins Server <jenk...@builds.apache.org>
Subject Hadoop-Mapreduce-trunk - Build # 1641 - Still Failing
Date Tue, 17 Dec 2013 15:01:46 GMT
See https://builds.apache.org/job/Hadoop-Mapreduce-trunk/1641/

###################################################################################
########################## LAST 60 LINES OF THE CONSOLE ###########################
[...truncated 32654 lines...]
Tests run: 1, Failures: 0, Errors: 0, Skipped: 0, Time elapsed: 0.061 sec - in org.apache.hadoop.mapreduce.filecache.TestURIFragments
Running org.apache.hadoop.mapreduce.TestMapReduce
Tests run: 1, Failures: 0, Errors: 0, Skipped: 0, Time elapsed: 7.279 sec - in org.apache.hadoop.mapreduce.TestMapReduce

Results :

Tests in error: 
  TestYARNRunner.testResourceMgrDelegate:212 » NullPointer
  TestJHSSecurity.testDelegationToken:100 » NullPointer

Tests run: 490, Failures: 0, Errors: 2, Skipped: 11

[INFO] ------------------------------------------------------------------------
[INFO] Reactor Summary:
[INFO] 
[INFO] hadoop-mapreduce-client ........................... SUCCESS [2.374s]
[INFO] hadoop-mapreduce-client-core ...................... SUCCESS [46.660s]
[INFO] hadoop-mapreduce-client-common .................... SUCCESS [25.725s]
[INFO] hadoop-mapreduce-client-shuffle ................... SUCCESS [2.402s]
[INFO] hadoop-mapreduce-client-app ....................... SUCCESS [6:35.658s]
[INFO] hadoop-mapreduce-client-hs ........................ SUCCESS [1:58.817s]
[INFO] hadoop-mapreduce-client-jobclient ................. FAILURE [1:32:20.028s]
[INFO] hadoop-mapreduce-client-hs-plugins ................ SKIPPED
[INFO] Apache Hadoop MapReduce Examples .................. SKIPPED
[INFO] hadoop-mapreduce .................................. SKIPPED
[INFO] ------------------------------------------------------------------------
[INFO] BUILD FAILURE
[INFO] ------------------------------------------------------------------------
[INFO] Total time: 1:42:12.718s
[INFO] Finished at: Tue Dec 17 15:01:28 UTC 2013
[INFO] Final Memory: 26M/125M
[INFO] ------------------------------------------------------------------------
[ERROR] Failed to execute goal org.apache.maven.plugins:maven-surefire-plugin:2.16:test (default-test)
on project hadoop-mapreduce-client-jobclient: There was a timeout or other error in the fork
-> [Help 1]
[ERROR] 
[ERROR] To see the full stack trace of the errors, re-run Maven with the -e switch.
[ERROR] Re-run Maven using the -X switch to enable full debug logging.
[ERROR] 
[ERROR] For more information about the errors and possible solutions, please read the following
articles:
[ERROR] [Help 1] http://cwiki.apache.org/confluence/display/MAVEN/MojoFailureException
[ERROR] 
[ERROR] After correcting the problems, you can resume the build with the command
[ERROR]   mvn <goals> -rf :hadoop-mapreduce-client-jobclient
Build step 'Execute shell' marked build as failure
[FINDBUGS] Skipping publisher since build result is FAILURE
Archiving artifacts
Updating HADOOP-8753
Updating HDFS-5454
Updating YARN-1446
Updating HADOOP-10106
Updating YARN-312
Updating HDFS-5350
Updating YARN-1451
Updating HDFS-5665
Updating HDFS-5666
Updating MAPREDUCE-5623
Updating YARN-1145
Updating YARN-1505
Email was triggered for: Failure
Sending email for trigger: Failure



###################################################################################
############################## FAILED TESTS (if any) ##############################
No tests ran.
Mime
  • Unnamed multipart/mixed (inline, None, 0 bytes)
View raw message