hadoop-mapreduce-dev mailing list archives

Site index · List index
Message view « Date » · « Thread »
Top « Date » · « Thread »
From Apache Jenkins Server <jenk...@builds.apache.org>
Subject Hadoop-Mapreduce-trunk - Build # 1642 - Still Failing
Date Wed, 18 Dec 2013 14:58:28 GMT
See https://builds.apache.org/job/Hadoop-Mapreduce-trunk/1642/

###################################################################################
########################## LAST 60 LINES OF THE CONSOLE ###########################
[...truncated 32852 lines...]
Results :

Tests in error: 
  TestJHSSecurity.testDelegationToken:100 ยป NullPointer

Tests run: 490, Failures: 0, Errors: 1, Skipped: 11

[INFO] ------------------------------------------------------------------------
[INFO] Reactor Summary:
[INFO] 
[INFO] hadoop-mapreduce-client ........................... SUCCESS [2.392s]
[INFO] hadoop-mapreduce-client-core ...................... SUCCESS [48.241s]
[INFO] hadoop-mapreduce-client-common .................... SUCCESS [25.763s]
[INFO] hadoop-mapreduce-client-shuffle ................... SUCCESS [2.371s]
[INFO] hadoop-mapreduce-client-app ....................... SUCCESS [6:38.054s]
[INFO] hadoop-mapreduce-client-hs ........................ SUCCESS [1:58.968s]
[INFO] hadoop-mapreduce-client-jobclient ................. FAILURE [1:28:54.113s]
[INFO] hadoop-mapreduce-client-hs-plugins ................ SKIPPED
[INFO] Apache Hadoop MapReduce Examples .................. SKIPPED
[INFO] hadoop-mapreduce .................................. SKIPPED
[INFO] ------------------------------------------------------------------------
[INFO] BUILD FAILURE
[INFO] ------------------------------------------------------------------------
[INFO] Total time: 1:38:50.952s
[INFO] Finished at: Wed Dec 18 14:58:09 UTC 2013
[INFO] Final Memory: 26M/83M
[INFO] ------------------------------------------------------------------------
[ERROR] Failed to execute goal org.apache.maven.plugins:maven-surefire-plugin:2.16:test (default-test)
on project hadoop-mapreduce-client-jobclient: There was a timeout or other error in the fork
-> [Help 1]
[ERROR] 
[ERROR] To see the full stack trace of the errors, re-run Maven with the -e switch.
[ERROR] Re-run Maven using the -X switch to enable full debug logging.
[ERROR] 
[ERROR] For more information about the errors and possible solutions, please read the following
articles:
[ERROR] [Help 1] http://cwiki.apache.org/confluence/display/MAVEN/MojoFailureException
[ERROR] 
[ERROR] After correcting the problems, you can resume the build with the command
[ERROR]   mvn <goals> -rf :hadoop-mapreduce-client-jobclient
Build step 'Execute shell' marked build as failure
[FINDBUGS] Skipping publisher since build result is FAILURE
Archiving artifacts
Updating HADOOP-10168
Updating MAPREDUCE-5197
Updating HDFS-5545
Updating HDFS-5536
Updating HDFS-5634
Updating YARN-1028
Updating HDFS-5674
Updating HDFS-5657
Updating HDFS-5629
Updating MAPREDUCE-5189
Updating HDFS-5538
Updating HDFS-5312
Updating YARN-1446
Updating HADOOP-9611
Updating MAPREDUCE-5679
Updating HDFS-5431
Updating MAPREDUCE-5687
Email was triggered for: Failure
Sending email for trigger: Failure



###################################################################################
############################## FAILED TESTS (if any) ##############################
No tests ran.
Mime
  • Unnamed multipart/mixed (inline, None, 0 bytes)
View raw message