hadoop-mapreduce-dev mailing list archives

Site index · List index
Message view « Date » · « Thread »
Top « Date » · « Thread »
From Apache Jenkins Server <jenk...@builds.apache.org>
Subject Hadoop-Mapreduce-trunk - Build # 1686 - Still Failing
Date Sun, 02 Feb 2014 13:30:09 GMT
See https://builds.apache.org/job/Hadoop-Mapreduce-trunk/1686/

###################################################################################
########################## LAST 60 LINES OF THE CONSOLE ###########################
[...truncated 34535 lines...]
Tests run: 4, Failures: 0, Errors: 0, Skipped: 0, Time elapsed: 9 sec - in org.apache.hadoop.mapreduce.v2.app.TestKill
Running org.apache.hadoop.mapreduce.v2.app.TestStagingCleanup
Tests run: 7, Failures: 0, Errors: 0, Skipped: 0, Time elapsed: 11.487 sec - in org.apache.hadoop.mapreduce.v2.app.TestStagingCleanup
Running org.apache.hadoop.mapreduce.v2.app.commit.TestCommitterEventHandler
Tests run: 3, Failures: 0, Errors: 0, Skipped: 0, Time elapsed: 1.285 sec - in org.apache.hadoop.mapreduce.v2.app.commit.TestCommitterEventHandler
Running org.apache.hadoop.mapreduce.v2.app.launcher.TestContainerLauncherImpl
Tests run: 4, Failures: 0, Errors: 0, Skipped: 0, Time elapsed: 1.688 sec - in org.apache.hadoop.mapreduce.v2.app.launcher.TestContainerLauncherImpl
Running org.apache.hadoop.mapreduce.v2.app.launcher.TestContainerLauncher
Tests run: 3, Failures: 0, Errors: 0, Skipped: 0, Time elapsed: 13.702 sec - in org.apache.hadoop.mapreduce.v2.app.launcher.TestContainerLauncher
Running org.apache.hadoop.mapreduce.jobhistory.TestJobHistoryEventHandler
Tests run: 7, Failures: 0, Errors: 0, Skipped: 0, Time elapsed: 10.254 sec - in org.apache.hadoop.mapreduce.jobhistory.TestJobHistoryEventHandler
Running org.apache.hadoop.mapreduce.jobhistory.TestEvents
Tests run: 5, Failures: 0, Errors: 0, Skipped: 0, Time elapsed: 0.724 sec - in org.apache.hadoop.mapreduce.jobhistory.TestEvents

Results :

Tests in error: 
  TestRMContainerAllocator.testCompletedTasksRecalculateSchedule:1665 ยป YarnRuntime

Tests run: 262, Failures: 0, Errors: 1, Skipped: 0

[INFO] ------------------------------------------------------------------------
[INFO] Reactor Summary:
[INFO] 
[INFO] hadoop-mapreduce-client ........................... SUCCESS [2.458s]
[INFO] hadoop-mapreduce-client-core ...................... SUCCESS [47.695s]
[INFO] hadoop-mapreduce-client-common .................... SUCCESS [25.596s]
[INFO] hadoop-mapreduce-client-shuffle ................... SUCCESS [2.381s]
[INFO] hadoop-mapreduce-client-app ....................... FAILURE [6:25.536s]
[INFO] hadoop-mapreduce-client-hs ........................ SKIPPED
[INFO] hadoop-mapreduce-client-jobclient ................. SKIPPED
[INFO] hadoop-mapreduce-client-hs-plugins ................ SKIPPED
[INFO] Apache Hadoop MapReduce Examples .................. SKIPPED
[INFO] hadoop-mapreduce .................................. SKIPPED
[INFO] ------------------------------------------------------------------------
[INFO] BUILD FAILURE
[INFO] ------------------------------------------------------------------------
[INFO] Total time: 7:44.701s
[INFO] Finished at: Sun Feb 02 13:30:01 UTC 2014
[INFO] Final Memory: 23M/175M
[INFO] ------------------------------------------------------------------------
[ERROR] Failed to execute goal org.apache.maven.plugins:maven-surefire-plugin:2.16:test (default-test)
on project hadoop-mapreduce-client-app: There are test failures.
[ERROR] 
[ERROR] Please refer to /home/jenkins/jenkins-slave/workspace/Hadoop-Mapreduce-trunk/trunk/hadoop-mapreduce-project/hadoop-mapreduce-client/hadoop-mapreduce-client-app/target/surefire-reports
for the individual test results.
[ERROR] -> [Help 1]
[ERROR] 
[ERROR] To see the full stack trace of the errors, re-run Maven with the -e switch.
[ERROR] Re-run Maven using the -X switch to enable full debug logging.
[ERROR] 
[ERROR] For more information about the errors and possible solutions, please read the following
articles:
[ERROR] [Help 1] http://cwiki.apache.org/confluence/display/MAVEN/MojoFailureException
[ERROR] 
[ERROR] After correcting the problems, you can resume the build with the command
[ERROR]   mvn <goals> -rf :hadoop-mapreduce-client-app
Build step 'Execute shell' marked build as failure
[FINDBUGS] Skipping publisher since build result is FAILURE
Archiving artifacts
Email was triggered for: Failure
Sending email for trigger: Failure



###################################################################################
############################## FAILED TESTS (if any) ##############################
No tests ran.
Mime
  • Unnamed multipart/mixed (inline, None, 0 bytes)
View raw message