hadoop-mapreduce-dev mailing list archives

Site index · List index
Message view « Date » · « Thread »
Top « Date » · « Thread »
From Apache Jenkins Server <jenk...@builds.apache.org>
Subject Hadoop-Mapreduce-trunk - Build # 1739 - Failure
Date Thu, 27 Mar 2014 13:51:03 GMT
See https://builds.apache.org/job/Hadoop-Mapreduce-trunk/1739/

###################################################################################
########################## LAST 60 LINES OF THE CONSOLE ###########################
[...truncated 33992 lines...]

Tests in error: 
  TestMRAppMaster.testMRAppMasterMidLock:163 » NullPointer
  TestMRAppMaster.testMRAppMasterSuccessLock:202 » NullPointer
  TestMRAppMaster.testMRAppMasterFailLock:241 » NullPointer

Tests run: 268, Failures: 0, Errors: 3, Skipped: 0

[INFO] ------------------------------------------------------------------------
[INFO] Reactor Summary:
[INFO] 
[INFO] hadoop-mapreduce-client ........................... SUCCESS [3.080s]
[INFO] hadoop-mapreduce-client-core ...................... SUCCESS [58.379s]
[INFO] hadoop-mapreduce-client-common .................... SUCCESS [28.195s]
[INFO] hadoop-mapreduce-client-shuffle ................... SUCCESS [4.168s]
[INFO] hadoop-mapreduce-client-app ....................... FAILURE [7:01.467s]
[INFO] hadoop-mapreduce-client-hs ........................ SKIPPED
[INFO] hadoop-mapreduce-client-jobclient ................. SKIPPED
[INFO] hadoop-mapreduce-client-hs-plugins ................ SKIPPED
[INFO] Apache Hadoop MapReduce Examples .................. SKIPPED
[INFO] hadoop-mapreduce .................................. SKIPPED
[INFO] ------------------------------------------------------------------------
[INFO] BUILD FAILURE
[INFO] ------------------------------------------------------------------------
[INFO] Total time: 8:36.544s
[INFO] Finished at: Thu Mar 27 13:48:05 UTC 2014
[INFO] Final Memory: 24M/297M
[INFO] ------------------------------------------------------------------------
[ERROR] Failed to execute goal org.apache.maven.plugins:maven-surefire-plugin:2.16:test (default-test)
on project hadoop-mapreduce-client-app: There are test failures.
[ERROR] 
[ERROR] Please refer to /home/jenkins/jenkins-slave/workspace/Hadoop-Mapreduce-trunk/trunk/hadoop-mapreduce-project/hadoop-mapreduce-client/hadoop-mapreduce-client-app/target/surefire-reports
for the individual test results.
[ERROR] -> [Help 1]
[ERROR] 
[ERROR] To see the full stack trace of the errors, re-run Maven with the -e switch.
[ERROR] Re-run Maven using the -X switch to enable full debug logging.
[ERROR] 
[ERROR] For more information about the errors and possible solutions, please read the following
articles:
[ERROR] [Help 1] http://cwiki.apache.org/confluence/display/MAVEN/MojoFailureException
[ERROR] 
[ERROR] After correcting the problems, you can resume the build with the command
[ERROR]   mvn <goals> -rf :hadoop-mapreduce-client-app
Build step 'Execute shell' marked build as failure
[FINDBUGS] Skipping publisher since build result is FAILURE
Archiving artifacts
Updating HADOOP-10441
Updating HADOOP-10440
Updating HADOOP-10437
Updating HDFS-6158
Updating HDFS-6157
Updating MAPREDUCE-5805
Updating HDFS-5672
Updating HDFS-6155
Updating HDFS-6119
Updating HDFS-6162
Updating HDFS-6150
Updating HDFS-6115
Updating YARN-1873
Email was triggered for: Failure
Sending email for trigger: Failure



###################################################################################
############################## FAILED TESTS (if any) ##############################
No tests ran.
Mime
  • Unnamed multipart/mixed (inline, None, 0 bytes)
View raw message