hadoop-mapreduce-dev mailing list archives

Site index · List index
Message view « Date » · « Thread »
Top « Date » · « Thread »
From Apache Jenkins Server <jenk...@builds.apache.org>
Subject Hadoop-Mapreduce-trunk - Build # 1753 - Still Failing
Date Thu, 10 Apr 2014 13:33:38 GMT
See https://builds.apache.org/job/Hadoop-Mapreduce-trunk/1753/

###################################################################################
########################## LAST 60 LINES OF THE CONSOLE ###########################
[...truncated 34937 lines...]
  TestMRAppMaster.testMRAppMasterFailLock:241 ยป NullPointer

Tests run: 268, Failures: 0, Errors: 3, Skipped: 0

[INFO] ------------------------------------------------------------------------
[INFO] Reactor Summary:
[INFO] 
[INFO] hadoop-mapreduce-client ........................... SUCCESS [2.515s]
[INFO] hadoop-mapreduce-client-core ...................... SUCCESS [52.512s]
[INFO] hadoop-mapreduce-client-common .................... SUCCESS [26.467s]
[INFO] hadoop-mapreduce-client-shuffle ................... SUCCESS [3.757s]
[INFO] hadoop-mapreduce-client-app ....................... FAILURE [6:31.397s]
[INFO] hadoop-mapreduce-client-hs ........................ SKIPPED
[INFO] hadoop-mapreduce-client-jobclient ................. SKIPPED
[INFO] hadoop-mapreduce-client-hs-plugins ................ SKIPPED
[INFO] Apache Hadoop MapReduce Examples .................. SKIPPED
[INFO] hadoop-mapreduce .................................. SKIPPED
[INFO] ------------------------------------------------------------------------
[INFO] BUILD FAILURE
[INFO] ------------------------------------------------------------------------
[INFO] Total time: 7:57.687s
[INFO] Finished at: Thu Apr 10 13:32:52 UTC 2014
[INFO] Final Memory: 24M/217M
[INFO] ------------------------------------------------------------------------
[ERROR] Failed to execute goal org.apache.maven.plugins:maven-surefire-plugin:2.16:test (default-test)
on project hadoop-mapreduce-client-app: There are test failures.
[ERROR] 
[ERROR] Please refer to /home/jenkins/jenkins-slave/workspace/Hadoop-Mapreduce-trunk/trunk/hadoop-mapreduce-project/hadoop-mapreduce-client/hadoop-mapreduce-client-app/target/surefire-reports
for the individual test results.
[ERROR] -> [Help 1]
[ERROR] 
[ERROR] To see the full stack trace of the errors, re-run Maven with the -e switch.
[ERROR] Re-run Maven using the -X switch to enable full debug logging.
[ERROR] 
[ERROR] For more information about the errors and possible solutions, please read the following
articles:
[ERROR] [Help 1] http://cwiki.apache.org/confluence/display/MAVEN/MojoFailureException
[ERROR] 
[ERROR] After correcting the problems, you can resume the build with the command
[ERROR]   mvn <goals> -rf :hadoop-mapreduce-client-app
Build step 'Execute shell' marked build as failure
[FINDBUGS] Skipping publisher since build result is FAILURE
Archiving artifacts
Updating HDFS-6170
Updating HADOOP-10485
Updating HDFS-6160
Updating HADOOP-10473
Updating HADOOP-10432
Updating HDFS-6209
Updating YARN-1910
Updating HDFS-6208
Updating HADOOP-10427
Updating HADOOP-10428
Updating YARN-1907
Updating HDFS-6225
Updating HDFS-6204
Updating HDFS-6215
Updating HADOOP-10429
Updating HDFS-6228
Updating HDFS-6206
Email was triggered for: Failure
Sending email for trigger: Failure



###################################################################################
############################## FAILED TESTS (if any) ##############################
No tests ran.
Mime
  • Unnamed multipart/mixed (inline, None, 0 bytes)
View raw message