hadoop-mapreduce-dev mailing list archives

Site index · List index
Message view « Date » · « Thread »
Top « Date » · « Thread »
From Apache Jenkins Server <jenk...@builds.apache.org>
Subject Hadoop-Mapreduce-trunk - Build # 1769 - Still Failing
Date Sat, 26 Apr 2014 15:13:47 GMT
See https://builds.apache.org/job/Hadoop-Mapreduce-trunk/1769/

###################################################################################
########################## LAST 60 LINES OF THE CONSOLE ###########################
[...truncated 34184 lines...]
Tests run: 3, Failures: 0, Errors: 0, Skipped: 0, Time elapsed: 0.146 sec - in org.apache.hadoop.mapreduce.lib.partition.TestKeyFieldHelper
Running org.apache.hadoop.mapreduce.lib.partition.TestBinaryPartitioner
Tests run: 4, Failures: 0, Errors: 0, Skipped: 0, Time elapsed: 0.516 sec - in org.apache.hadoop.mapreduce.lib.partition.TestBinaryPartitioner
Running org.apache.hadoop.mapreduce.lib.partition.TestMRKeyFieldBasedPartitioner
Tests run: 1, Failures: 0, Errors: 0, Skipped: 0, Time elapsed: 0.453 sec - in org.apache.hadoop.mapreduce.lib.partition.TestMRKeyFieldBasedPartitioner
Running org.apache.hadoop.mapreduce.TestChild
Tests run: 1, Failures: 0, Errors: 0, Skipped: 0, Time elapsed: 82.704 sec - in org.apache.hadoop.mapreduce.TestChild
Running org.apache.hadoop.mapreduce.filecache.TestURIFragments
Tests run: 1, Failures: 0, Errors: 0, Skipped: 0, Time elapsed: 0.064 sec - in org.apache.hadoop.mapreduce.filecache.TestURIFragments
Running org.apache.hadoop.mapreduce.TestMapReduce
Tests run: 1, Failures: 0, Errors: 0, Skipped: 0, Time elapsed: 5.995 sec - in org.apache.hadoop.mapreduce.TestMapReduce
Running org.apache.hadoop.mapreduce.TestNewCombinerGrouping
Tests run: 1, Failures: 0, Errors: 0, Skipped: 0, Time elapsed: 6.607 sec - in org.apache.hadoop.mapreduce.TestNewCombinerGrouping

Results :

Tests run: 494, Failures: 0, Errors: 0, Skipped: 11

[INFO] ------------------------------------------------------------------------
[INFO] Reactor Summary:
[INFO] 
[INFO] hadoop-mapreduce-client ........................... SUCCESS [2.520s]
[INFO] hadoop-mapreduce-client-core ...................... SUCCESS [52.717s]
[INFO] hadoop-mapreduce-client-common .................... SUCCESS [25.608s]
[INFO] hadoop-mapreduce-client-shuffle ................... SUCCESS [3.784s]
[INFO] hadoop-mapreduce-client-app ....................... SUCCESS [6:56.397s]
[INFO] hadoop-mapreduce-client-hs ........................ SUCCESS [4:42.725s]
[INFO] hadoop-mapreduce-client-jobclient ................. FAILURE [1:35:40.743s]
[INFO] hadoop-mapreduce-client-hs-plugins ................ SKIPPED
[INFO] Apache Hadoop MapReduce Examples .................. SKIPPED
[INFO] hadoop-mapreduce .................................. SKIPPED
[INFO] ------------------------------------------------------------------------
[INFO] BUILD FAILURE
[INFO] ------------------------------------------------------------------------
[INFO] Total time: 1:48:45.514s
[INFO] Finished at: Sat Apr 26 15:13:31 UTC 2014
[INFO] Final Memory: 28M/102M
[INFO] ------------------------------------------------------------------------
[ERROR] Failed to execute goal org.apache.maven.plugins:maven-surefire-plugin:2.16:test (default-test)
on project hadoop-mapreduce-client-jobclient: There was a timeout or other error in the fork
-> [Help 1]
[ERROR] 
[ERROR] To see the full stack trace of the errors, re-run Maven with the -e switch.
[ERROR] Re-run Maven using the -X switch to enable full debug logging.
[ERROR] 
[ERROR] For more information about the errors and possible solutions, please read the following
articles:
[ERROR] [Help 1] http://cwiki.apache.org/confluence/display/MAVEN/MojoFailureException
[ERROR] 
[ERROR] After correcting the problems, you can resume the build with the command
[ERROR]   mvn <goals> -rf :hadoop-mapreduce-client-jobclient
Build step 'Execute shell' marked build as failure
[FINDBUGS] Skipping publisher since build result is FAILURE
Archiving artifacts
Updating HDFS-6270
Updating YARN-483
Updating MAPREDUCE-5639
Updating MAPREDUCE-5749
Updating HDFS-5865
Updating MAPREDUCE-5835
Email was triggered for: Failure
Sending email for trigger: Failure



###################################################################################
############################## FAILED TESTS (if any) ##############################
No tests ran.
Mime
  • Unnamed multipart/mixed (inline, None, 0 bytes)
View raw message