hadoop-mapreduce-dev mailing list archives

Site index · List index
Message view « Date » · « Thread »
Top « Date » · « Thread »
From Apache Jenkins Server <jenk...@builds.apache.org>
Subject Hadoop-Mapreduce-trunk - Build # 1772 - Still Failing
Date Tue, 29 Apr 2014 15:16:41 GMT
See https://builds.apache.org/job/Hadoop-Mapreduce-trunk/1772/

###################################################################################
########################## LAST 60 LINES OF THE CONSOLE ###########################
[...truncated 35344 lines...]
Tests run: 3, Failures: 0, Errors: 0, Skipped: 0, Time elapsed: 0.147 sec - in org.apache.hadoop.mapreduce.lib.partition.TestKeyFieldHelper
Running org.apache.hadoop.mapreduce.lib.partition.TestBinaryPartitioner
Tests run: 4, Failures: 0, Errors: 0, Skipped: 0, Time elapsed: 0.524 sec - in org.apache.hadoop.mapreduce.lib.partition.TestBinaryPartitioner
Running org.apache.hadoop.mapreduce.lib.partition.TestMRKeyFieldBasedPartitioner
Tests run: 1, Failures: 0, Errors: 0, Skipped: 0, Time elapsed: 0.458 sec - in org.apache.hadoop.mapreduce.lib.partition.TestMRKeyFieldBasedPartitioner
Running org.apache.hadoop.mapreduce.TestChild
Tests run: 1, Failures: 0, Errors: 0, Skipped: 0, Time elapsed: 82.76 sec - in org.apache.hadoop.mapreduce.TestChild
Running org.apache.hadoop.mapreduce.filecache.TestURIFragments
Tests run: 1, Failures: 0, Errors: 0, Skipped: 0, Time elapsed: 0.066 sec - in org.apache.hadoop.mapreduce.filecache.TestURIFragments
Running org.apache.hadoop.mapreduce.TestMapReduce
Tests run: 1, Failures: 0, Errors: 0, Skipped: 0, Time elapsed: 6.015 sec - in org.apache.hadoop.mapreduce.TestMapReduce
Running org.apache.hadoop.mapreduce.TestNewCombinerGrouping
Tests run: 1, Failures: 0, Errors: 0, Skipped: 0, Time elapsed: 6.591 sec - in org.apache.hadoop.mapreduce.TestNewCombinerGrouping

Results :

Tests run: 494, Failures: 0, Errors: 0, Skipped: 11

[INFO] ------------------------------------------------------------------------
[INFO] Reactor Summary:
[INFO] 
[INFO] hadoop-mapreduce-client ........................... SUCCESS [2.671s]
[INFO] hadoop-mapreduce-client-core ...................... SUCCESS [52.650s]
[INFO] hadoop-mapreduce-client-common .................... SUCCESS [25.925s]
[INFO] hadoop-mapreduce-client-shuffle ................... SUCCESS [3.764s]
[INFO] hadoop-mapreduce-client-app ....................... SUCCESS [7:04.708s]
[INFO] hadoop-mapreduce-client-hs ........................ SUCCESS [4:43.209s]
[INFO] hadoop-mapreduce-client-jobclient ................. FAILURE [1:36:23.818s]
[INFO] hadoop-mapreduce-client-hs-plugins ................ SKIPPED
[INFO] Apache Hadoop MapReduce Examples .................. SKIPPED
[INFO] hadoop-mapreduce .................................. SKIPPED
[INFO] ------------------------------------------------------------------------
[INFO] BUILD FAILURE
[INFO] ------------------------------------------------------------------------
[INFO] Total time: 1:49:37.769s
[INFO] Finished at: Tue Apr 29 15:14:50 UTC 2014
[INFO] Final Memory: 29M/94M
[INFO] ------------------------------------------------------------------------
[ERROR] Failed to execute goal org.apache.maven.plugins:maven-surefire-plugin:2.16:test (default-test)
on project hadoop-mapreduce-client-jobclient: There was a timeout or other error in the fork
-> [Help 1]
[ERROR] 
[ERROR] To see the full stack trace of the errors, re-run Maven with the -e switch.
[ERROR] Re-run Maven using the -X switch to enable full debug logging.
[ERROR] 
[ERROR] For more information about the errors and possible solutions, please read the following
articles:
[ERROR] [Help 1] http://cwiki.apache.org/confluence/display/MAVEN/MojoFailureException
[ERROR] 
[ERROR] After correcting the problems, you can resume the build with the command
[ERROR]   mvn <goals> -rf :hadoop-mapreduce-client-jobclient
Build step 'Execute shell' marked build as failure
[FINDBUGS] Skipping publisher since build result is FAILURE
Archiving artifacts
Updating MAPREDUCE-5812
Updating HDFS-2882
Updating HADOOP-10322
Updating HDFS-6288
Updating HADOOP-10508
Updating HDFS-6218
Email was triggered for: Failure
Sending email for trigger: Failure



###################################################################################
############################## FAILED TESTS (if any) ##############################
No tests ran.
Mime
  • Unnamed multipart/mixed (inline, None, 0 bytes)
View raw message