hadoop-mapreduce-dev mailing list archives

Site index · List index
Message view « Date » · « Thread »
Top « Date » · « Thread »
From Apache Jenkins Server <jenk...@builds.apache.org>
Subject Hadoop-Mapreduce-22-branch - Build # 116 - Failure
Date Mon, 12 May 2014 22:41:51 GMT
See https://builds.apache.org/job/Hadoop-Mapreduce-22-branch/116/

###################################################################################
########################## LAST 60 LINES OF THE CONSOLE ###########################
[...truncated 2599 lines...]
     [echo]   

clover:

ivy-download:
      [get] Getting: http://repo2.maven.org/maven2/org/apache/ivy/ivy/2.1.0/ivy-2.1.0.jar
      [get] To: /home/jenkins/jenkins-slave/workspace/Hadoop-Mapreduce-22-branch/trunk/ivy/ivy-2.1.0.jar
      [get] Not modified - so not downloaded

ivy-init-dirs:

ivy-probe-antlib:

ivy-init-antlib:

ivy-init:

ivy-resolve-common:

ivy-retrieve-common:

init:
    [touch] Creating /tmp/null1630614233
   [delete] Deleting: /tmp/null1630614233
    [unzip] Expanding: /home/jenkins/jenkins-slave/workspace/Hadoop-Mapreduce-22-branch/trunk/build/ivy/lib/Hadoop/common/hadoop-hdfs-0.22.1-SNAPSHOT.jar
into /home/jenkins/jenkins-slave/workspace/Hadoop-Mapreduce-22-branch/trunk/build

avro-generate:
    [mkdir] Created dir: /home/jenkins/jenkins-slave/workspace/Hadoop-Mapreduce-22-branch/trunk/build/src/org/apache/hadoop/mapreduce/jobhistory

compile-mapred-classes:
[jsp-compile] 14/05/12 22:41:24 WARN compiler.TldLocationsCache: Internal Error: File /WEB-INF/web.xml
not found
    [javac] Compiling 525 source files to /home/jenkins/jenkins-slave/workspace/Hadoop-Mapreduce-22-branch/trunk/build/classes
    [javac] /home/jenkins/jenkins-slave/workspace/Hadoop-Mapreduce-22-branch/trunk/src/java/org/apache/hadoop/mapreduce/util/MRAsyncDiskService.java:347:
cannot find symbol
    [javac] symbol  : constructor PathDeletionContext(org.apache.hadoop.fs.Path,<nulltype>,<nulltype>,<nulltype>,org.apache.hadoop.fs.FileSystem)
    [javac] location: class org.apache.hadoop.mapred.CleanupQueue.PathDeletionContext
    [javac]     item = new PathDeletionContext(
    [javac]            ^
    [javac] Note: Some input files use or override a deprecated API.
    [javac] Note: Recompile with -Xlint:deprecation for details.
    [javac] 1 error

BUILD FAILED
/home/jenkins/jenkins-slave/workspace/Hadoop-Mapreduce-22-branch/trunk/build.xml:397: Compile
failed; see the compiler error output for details.

Total time: 1 minute 13 seconds
+ RESULT=1
+ [ 1 != 0 ]
+ echo Build Failed: remaining tests not run
Build Failed: remaining tests not run
+ exit 1
Build step 'Execute shell' marked build as failure
[FINDBUGS] Skipping publisher since build result is FAILURE
Archiving artifacts
Recording test results
Publishing Javadoc
Recording fingerprints
Updating MAPREDUCE-5706
Email was triggered for: Failure
Sending email for trigger: Failure



###################################################################################
############################## FAILED TESTS (if any) ##############################
No tests ran.
Mime
  • Unnamed multipart/mixed (inline, None, 0 bytes)
View raw message