hadoop-mapreduce-dev mailing list archives

Site index · List index
Message view « Date » · « Thread »
Top « Date » · « Thread »
From Apache Jenkins Server <jenk...@builds.apache.org>
Subject Hadoop-Mapreduce-trunk - Build # 1787 - Still Failing
Date Sat, 31 May 2014 16:16:03 GMT
See https://builds.apache.org/job/Hadoop-Mapreduce-trunk/1787/

###################################################################################
########################## LAST 60 LINES OF THE CONSOLE ###########################
[...truncated 34667 lines...]
Tests run: 1, Failures: 0, Errors: 0, Skipped: 0, Time elapsed: 81.584 sec - in org.apache.hadoop.mapreduce.TestChild
Running org.apache.hadoop.mapreduce.filecache.TestURIFragments
Tests run: 1, Failures: 0, Errors: 0, Skipped: 0, Time elapsed: 0.065 sec - in org.apache.hadoop.mapreduce.filecache.TestURIFragments
Running org.apache.hadoop.mapreduce.TestMapReduce
Tests run: 1, Failures: 0, Errors: 0, Skipped: 0, Time elapsed: 6.029 sec - in org.apache.hadoop.mapreduce.TestMapReduce
Running org.apache.hadoop.mapreduce.TestNewCombinerGrouping
Tests run: 1, Failures: 0, Errors: 0, Skipped: 0, Time elapsed: 6.594 sec - in org.apache.hadoop.mapreduce.TestNewCombinerGrouping

Results :

Tests run: 494, Failures: 0, Errors: 0, Skipped: 11

[INFO] ------------------------------------------------------------------------
[INFO] Reactor Summary:
[INFO] 
[INFO] hadoop-mapreduce-client ........................... SUCCESS [2.641s]
[INFO] hadoop-mapreduce-client-core ...................... SUCCESS [52.769s]
[INFO] hadoop-mapreduce-client-common .................... SUCCESS [25.773s]
[INFO] hadoop-mapreduce-client-shuffle ................... SUCCESS [4.320s]
[INFO] hadoop-mapreduce-client-app ....................... SUCCESS [7:04.287s]
[INFO] hadoop-mapreduce-client-hs ........................ SUCCESS [4:43.850s]
[INFO] hadoop-mapreduce-client-jobclient ................. FAILURE [1:37:12.052s]
[INFO] hadoop-mapreduce-client-hs-plugins ................ SKIPPED
[INFO] Apache Hadoop MapReduce Examples .................. SKIPPED
[INFO] hadoop-mapreduce .................................. SKIPPED
[INFO] ------------------------------------------------------------------------
[INFO] BUILD FAILURE
[INFO] ------------------------------------------------------------------------
[INFO] Total time: 1:50:26.713s
[INFO] Finished at: Sat May 31 15:16:32 UTC 2014
[INFO] Final Memory: 28M/72M
[INFO] ------------------------------------------------------------------------
[ERROR] Failed to execute goal org.apache.maven.plugins:maven-surefire-plugin:2.16:test (default-test)
on project hadoop-mapreduce-client-jobclient: There was a timeout or other error in the fork
-> [Help 1]
[ERROR] 
[ERROR] To see the full stack trace of the errors, re-run Maven with the -e switch.
[ERROR] Re-run Maven using the -X switch to enable full debug logging.
[ERROR] 
[ERROR] For more information about the errors and possible solutions, please read the following
articles:
[ERROR] [Help 1] http://cwiki.apache.org/confluence/display/MAVEN/MojoFailureException
[ERROR] 
[ERROR] After correcting the problems, you can resume the build with the command
[ERROR]   mvn <goals> -rf :hadoop-mapreduce-client-jobclient
Build step 'Execute shell' marked build as failure
[FINDBUGS] Skipping publisher since build result is FAILURE
Archiving artifacts
Updating HDFS-6110
Updating YARN-1868
Updating HADOOP-10611
Updating YARN-2054
Updating HDFS-6472
Updating HADOOP-10645
Updating YARN-1338
Updating HDFS-6056
Updating HDFS-6375
Updating YARN-2010
Updating HDFS-6404
Updating YARN-2115
Email was triggered for: Failure
Sending email for trigger: Failure



###################################################################################
############################## FAILED TESTS (if any) ##############################
No tests ran.
Mime
  • Unnamed multipart/mixed (inline, None, 0 bytes)
View raw message