hadoop-mapreduce-dev mailing list archives

Site index · List index
Message view « Date » · « Thread »
Top « Date » · « Thread »
From Apache Jenkins Server <jenk...@builds.apache.org>
Subject Hadoop-Mapreduce-trunk - Build # 1777 - Still Failing
Date Thu, 08 May 2014 15:17:32 GMT
See https://builds.apache.org/job/Hadoop-Mapreduce-trunk/1777/

###################################################################################
########################## LAST 60 LINES OF THE CONSOLE ###########################
[...truncated 35449 lines...]
Running org.apache.hadoop.mapreduce.filecache.TestURIFragments
Tests run: 1, Failures: 0, Errors: 0, Skipped: 0, Time elapsed: 0.065 sec - in org.apache.hadoop.mapreduce.filecache.TestURIFragments
Running org.apache.hadoop.mapreduce.TestMapReduce
Tests run: 1, Failures: 0, Errors: 0, Skipped: 0, Time elapsed: 4.996 sec - in org.apache.hadoop.mapreduce.TestMapReduce
Running org.apache.hadoop.mapreduce.TestNewCombinerGrouping
Tests run: 1, Failures: 0, Errors: 0, Skipped: 0, Time elapsed: 6.584 sec - in org.apache.hadoop.mapreduce.TestNewCombinerGrouping

Results :

Tests run: 494, Failures: 0, Errors: 0, Skipped: 11

[INFO] ------------------------------------------------------------------------
[INFO] Reactor Summary:
[INFO] 
[INFO] hadoop-mapreduce-client ........................... SUCCESS [2.526s]
[INFO] hadoop-mapreduce-client-core ...................... SUCCESS [53.570s]
[INFO] hadoop-mapreduce-client-common .................... SUCCESS [25.739s]
[INFO] hadoop-mapreduce-client-shuffle ................... SUCCESS [3.776s]
[INFO] hadoop-mapreduce-client-app ....................... SUCCESS [7:03.399s]
[INFO] hadoop-mapreduce-client-hs ........................ SUCCESS [4:43.238s]
[INFO] hadoop-mapreduce-client-jobclient ................. FAILURE [1:38:38.237s]
[INFO] hadoop-mapreduce-client-hs-plugins ................ SKIPPED
[INFO] Apache Hadoop MapReduce Examples .................. SKIPPED
[INFO] hadoop-mapreduce .................................. SKIPPED
[INFO] ------------------------------------------------------------------------
[INFO] BUILD FAILURE
[INFO] ------------------------------------------------------------------------
[INFO] Total time: 1:51:51.513s
[INFO] Finished at: Thu May 08 15:17:17 UTC 2014
[INFO] Final Memory: 28M/97M
[INFO] ------------------------------------------------------------------------
[ERROR] Failed to execute goal org.apache.maven.plugins:maven-surefire-plugin:2.16:test (default-test)
on project hadoop-mapreduce-client-jobclient: There was a timeout or other error in the fork
-> [Help 1]
[ERROR] 
[ERROR] To see the full stack trace of the errors, re-run Maven with the -e switch.
[ERROR] Re-run Maven using the -X switch to enable full debug logging.
[ERROR] 
[ERROR] For more information about the errors and possible solutions, please read the following
articles:
[ERROR] [Help 1] http://cwiki.apache.org/confluence/display/MAVEN/MojoFailureException
[ERROR] 
[ERROR] After correcting the problems, you can resume the build with the command
[ERROR]   mvn <goals> -rf :hadoop-mapreduce-client-jobclient
Build step 'Execute shell' marked build as failure
[FINDBUGS] Skipping publisher since build result is FAILURE
Archiving artifacts
Updating MAPREDUCE-5636
Updating HADOOP-10562
Updating HADOOP-10541
Updating MAPREDUCE-5402
Updating HADOOP-10467
Updating HADOOP-10566
Updating HADOOP-10556
Updating HADOOP-10433
Updating HADOOP-10471
Updating YARN-1864
Updating YARN-2018
Updating HADOOP-10517
Updating MAPREDUCE-5637
Email was triggered for: Failure
Sending email for trigger: Failure



###################################################################################
############################## FAILED TESTS (if any) ##############################
No tests ran.
Mime
  • Unnamed multipart/mixed (inline, None, 0 bytes)
View raw message