hadoop-mapreduce-dev mailing list archives

Site index · List index
Message view « Date » · « Thread »
Top « Date » · « Thread »
From Apache Jenkins Server <jenk...@builds.apache.org>
Subject Hadoop-Mapreduce-trunk - Build # 1807 - Still Failing
Date Fri, 20 Jun 2014 15:18:04 GMT
See https://builds.apache.org/job/Hadoop-Mapreduce-trunk/1807/

###################################################################################
########################## LAST 60 LINES OF THE CONSOLE ###########################
[...truncated 35053 lines...]
Running org.apache.hadoop.mapreduce.TestMapReduce
Tests run: 1, Failures: 0, Errors: 0, Skipped: 0, Time elapsed: 6.013 sec - in org.apache.hadoop.mapreduce.TestMapReduce
Running org.apache.hadoop.mapreduce.TestNewCombinerGrouping
Tests run: 1, Failures: 0, Errors: 0, Skipped: 0, Time elapsed: 6.615 sec - in org.apache.hadoop.mapreduce.TestNewCombinerGrouping

Results :

Tests run: 494, Failures: 0, Errors: 0, Skipped: 11

[INFO] ------------------------------------------------------------------------
[INFO] Reactor Summary:
[INFO] 
[INFO] hadoop-mapreduce-client ........................... SUCCESS [2.598s]
[INFO] hadoop-mapreduce-client-core ...................... SUCCESS [54.683s]
[INFO] hadoop-mapreduce-client-common .................... SUCCESS [26.023s]
[INFO] hadoop-mapreduce-client-shuffle ................... SUCCESS [4.278s]
[INFO] hadoop-mapreduce-client-app ....................... SUCCESS [7:07.842s]
[INFO] hadoop-mapreduce-client-hs ........................ SUCCESS [4:44.084s]
[INFO] hadoop-mapreduce-client-jobclient ................. FAILURE [1:38:19.499s]
[INFO] hadoop-mapreduce-client-hs-plugins ................ SKIPPED
[INFO] Apache Hadoop MapReduce Examples .................. SKIPPED
[INFO] hadoop-mapreduce .................................. SKIPPED
[INFO] ------------------------------------------------------------------------
[INFO] BUILD FAILURE
[INFO] ------------------------------------------------------------------------
[INFO] Total time: 1:51:40.045s
[INFO] Finished at: Fri Jun 20 15:17:39 UTC 2014
[INFO] Final Memory: 28M/80M
[INFO] ------------------------------------------------------------------------
[ERROR] Failed to execute goal org.apache.maven.plugins:maven-surefire-plugin:2.16:test (default-test)
on project hadoop-mapreduce-client-jobclient: There was a timeout or other error in the fork
-> [Help 1]
[ERROR] 
[ERROR] To see the full stack trace of the errors, re-run Maven with the -e switch.
[ERROR] Re-run Maven using the -X switch to enable full debug logging.
[ERROR] 
[ERROR] For more information about the errors and possible solutions, please read the following
articles:
[ERROR] [Help 1] http://cwiki.apache.org/confluence/display/MAVEN/MojoFailureException
[ERROR] 
[ERROR] After correcting the problems, you can resume the build with the command
[ERROR]   mvn <goals> -rf :hadoop-mapreduce-client-jobclient
Build step 'Execute shell' marked build as failure
[FINDBUGS] Skipping publisher since build result is FAILURE
Archiving artifacts
Sending artifact delta relative to Hadoop-Mapreduce-trunk #1765
Archived 2 artifacts
Archive block size is 32768
Received 0 blocks and 16954691 bytes
Compression is 0.0%
Took 13 sec
Updating HDFS-6549
Updating HADOOP-10696
Updating HDFS-6492
Updating HDFS-3848
Updating HADOOP-10279
Updating HDFS-6312
Updating HDFS-6375
Updating MAPREDUCE-5844
Updating HDFS-6403
Email was triggered for: Failure
Sending email for trigger: Failure



###################################################################################
############################## FAILED TESTS (if any) ##############################
No tests ran.
Mime
  • Unnamed multipart/mixed (inline, None, 0 bytes)
View raw message