hadoop-mapreduce-dev mailing list archives

Site index · List index
Message view « Date » · « Thread »
Top « Date » · « Thread »
From Apache Jenkins Server <jenk...@builds.apache.org>
Subject Hadoop-Mapreduce-22-branch - Build # 117 - Still Failing
Date Wed, 09 Jul 2014 10:32:33 GMT
See https://builds.apache.org/job/Hadoop-Mapreduce-22-branch/117/

###################################################################################
########################## LAST 60 LINES OF THE CONSOLE ###########################
[...truncated 2568 lines...]
ivy-retrieve-common:
[ivy:cachepath] DEPRECATED: 'ivy.conf.file' is deprecated, use 'ivy.settings.file' instead
[ivy:cachepath] :: loading settings :: file = /home/jenkins/jenkins-slave/workspace/Hadoop-Mapreduce-22-branch/trunk/ivy/ivysettings.xml

init:
    [mkdir] Created dir: /home/jenkins/jenkins-slave/workspace/Hadoop-Mapreduce-22-branch/trunk/build/classes
    [mkdir] Created dir: /home/jenkins/jenkins-slave/workspace/Hadoop-Mapreduce-22-branch/trunk/build/tools
    [mkdir] Created dir: /home/jenkins/jenkins-slave/workspace/Hadoop-Mapreduce-22-branch/trunk/build/src
    [mkdir] Created dir: /home/jenkins/jenkins-slave/workspace/Hadoop-Mapreduce-22-branch/trunk/build/webapps/task/WEB-INF
    [mkdir] Created dir: /home/jenkins/jenkins-slave/workspace/Hadoop-Mapreduce-22-branch/trunk/build/webapps/job/WEB-INF
    [mkdir] Created dir: /home/jenkins/jenkins-slave/workspace/Hadoop-Mapreduce-22-branch/trunk/build/examples
    [mkdir] Created dir: /home/jenkins/jenkins-slave/workspace/Hadoop-Mapreduce-22-branch/trunk/build/c++
    [mkdir] Created dir: /home/jenkins/jenkins-slave/workspace/Hadoop-Mapreduce-22-branch/trunk/build/test
    [mkdir] Created dir: /home/jenkins/jenkins-slave/workspace/Hadoop-Mapreduce-22-branch/trunk/build/test/classes
    [mkdir] Created dir: /home/jenkins/jenkins-slave/workspace/Hadoop-Mapreduce-22-branch/trunk/build/test/extraconf
    [touch] Creating /tmp/null1194949095
   [delete] Deleting: /tmp/null1194949095
     [copy] Copying 7 files to /home/jenkins/jenkins-slave/workspace/Hadoop-Mapreduce-22-branch/trunk/build/webapps
    [unzip] Expanding: /home/jenkins/jenkins-slave/workspace/Hadoop-Mapreduce-22-branch/trunk/build/ivy/lib/Hadoop/common/hadoop-hdfs-0.22.1-SNAPSHOT.jar
into /home/jenkins/jenkins-slave/workspace/Hadoop-Mapreduce-22-branch/trunk/build
     [copy] Copying 4 files to /home/jenkins/jenkins-slave/workspace/Hadoop-Mapreduce-22-branch/trunk/conf
     [copy] Copying /home/jenkins/jenkins-slave/workspace/Hadoop-Mapreduce-22-branch/trunk/conf/capacity-scheduler.xml.template
to /home/jenkins/jenkins-slave/workspace/Hadoop-Mapreduce-22-branch/trunk/conf/capacity-scheduler.xml
     [copy] Copying /home/jenkins/jenkins-slave/workspace/Hadoop-Mapreduce-22-branch/trunk/conf/fair-scheduler.xml.template
to /home/jenkins/jenkins-slave/workspace/Hadoop-Mapreduce-22-branch/trunk/conf/fair-scheduler.xml
     [copy] Copying /home/jenkins/jenkins-slave/workspace/Hadoop-Mapreduce-22-branch/trunk/conf/mapred-queues.xml.template
to /home/jenkins/jenkins-slave/workspace/Hadoop-Mapreduce-22-branch/trunk/conf/mapred-queues.xml
     [copy] Copying /home/jenkins/jenkins-slave/workspace/Hadoop-Mapreduce-22-branch/trunk/conf/mapred-site.xml.template
to /home/jenkins/jenkins-slave/workspace/Hadoop-Mapreduce-22-branch/trunk/conf/mapred-site.xml
    [mkdir] Created dir: /home/jenkins/jenkins-slave/workspace/Hadoop-Mapreduce-22-branch/trunk/build/test/conf
     [copy] Copying 4 files to /home/jenkins/jenkins-slave/workspace/Hadoop-Mapreduce-22-branch/trunk/build/test/conf
     [copy] Copying /home/jenkins/jenkins-slave/workspace/Hadoop-Mapreduce-22-branch/trunk/conf/capacity-scheduler.xml.template
to /home/jenkins/jenkins-slave/workspace/Hadoop-Mapreduce-22-branch/trunk/build/test/conf/capacity-scheduler.xml
     [copy] Copying /home/jenkins/jenkins-slave/workspace/Hadoop-Mapreduce-22-branch/trunk/conf/fair-scheduler.xml.template
to /home/jenkins/jenkins-slave/workspace/Hadoop-Mapreduce-22-branch/trunk/build/test/conf/fair-scheduler.xml
     [copy] Copying /home/jenkins/jenkins-slave/workspace/Hadoop-Mapreduce-22-branch/trunk/conf/mapred-queues.xml.template
to /home/jenkins/jenkins-slave/workspace/Hadoop-Mapreduce-22-branch/trunk/build/test/conf/mapred-queues.xml
     [copy] Copying /home/jenkins/jenkins-slave/workspace/Hadoop-Mapreduce-22-branch/trunk/conf/mapred-site.xml.template
to /home/jenkins/jenkins-slave/workspace/Hadoop-Mapreduce-22-branch/trunk/build/test/conf/mapred-site.xml
     [copy] Copying 2 files to /home/jenkins/jenkins-slave/workspace/Hadoop-Mapreduce-22-branch/trunk/src/contrib
     [copy] Copying /home/jenkins/jenkins-slave/workspace/Hadoop-Mapreduce-22-branch/trunk/src/contrib/capacity-scheduler/src/java/mapred-queues.xml.template
to /home/jenkins/jenkins-slave/workspace/Hadoop-Mapreduce-22-branch/trunk/src/contrib/capacity-scheduler/src/java/mapred-queues.xml
     [copy] Copying /home/jenkins/jenkins-slave/workspace/Hadoop-Mapreduce-22-branch/trunk/src/contrib/index/conf/index-config.xml.template
to /home/jenkins/jenkins-slave/workspace/Hadoop-Mapreduce-22-branch/trunk/src/contrib/index/conf/index-config.xml

check-c++-configure:

create-c++-utils-configure:
     [exec] configure.ac:39: error: possibly undefined macro: AC_PROG_LIBTOOL
     [exec]       If this token and others are legitimate, please use m4_pattern_allow.
     [exec]       See the Autoconf documentation.
     [exec] autoreconf: /usr/bin/autoconf failed with exit status: 1

BUILD FAILED
/home/jenkins/jenkins-slave/workspace/Hadoop-Mapreduce-22-branch/trunk/build.xml:1790: exec
returned: 1

Total time: 1 minute 25 seconds
+ RESULT=1
+ [ 1 != 0 ]
+ echo Build Failed: remaining tests not run
Build Failed: remaining tests not run
+ exit 1
Build step 'Execute shell' marked build as failure
[FINDBUGS] Skipping publisher since build result is FAILURE
Archiving artifacts
Recording test results
Publishing Javadoc
Recording fingerprints
Email was triggered for: Failure
Sending email for trigger: Failure



###################################################################################
############################## FAILED TESTS (if any) ##############################
No tests ran.
Mime
  • Unnamed multipart/mixed (inline, None, 0 bytes)
View raw message