hadoop-mapreduce-dev mailing list archives

Site index · List index
Message view « Date » · « Thread »
Top « Date » · « Thread »
From Apache Jenkins Server <jenk...@builds.apache.org>
Subject Hadoop-Mapreduce-trunk - Build # 1835 - Still Failing
Date Fri, 18 Jul 2014 13:38:19 GMT
See https://builds.apache.org/job/Hadoop-Mapreduce-trunk/1835/

###################################################################################
########################## LAST 60 LINES OF THE CONSOLE ###########################
[...truncated 36404 lines...]
Tests run: 280, Failures: 0, Errors: 73, Skipped: 0

[INFO] ------------------------------------------------------------------------
[INFO] Reactor Summary:
[INFO] 
[INFO] hadoop-mapreduce-client ........................... SUCCESS [  2.528 s]
[INFO] hadoop-mapreduce-client-core ...................... SUCCESS [ 53.857 s]
[INFO] hadoop-mapreduce-client-common .................... SUCCESS [ 26.959 s]
[INFO] hadoop-mapreduce-client-shuffle ................... SUCCESS [  4.225 s]
[INFO] hadoop-mapreduce-client-app ....................... FAILURE [14:55 min]
[INFO] hadoop-mapreduce-client-hs ........................ SKIPPED
[INFO] hadoop-mapreduce-client-jobclient ................. SKIPPED
[INFO] hadoop-mapreduce-client-hs-plugins ................ SKIPPED
[INFO] Apache Hadoop MapReduce Examples .................. SKIPPED
[INFO] hadoop-mapreduce .................................. SKIPPED
[INFO] ------------------------------------------------------------------------
[INFO] BUILD FAILURE
[INFO] ------------------------------------------------------------------------
[INFO] Total time: 16:23 min
[INFO] Finished at: 2014-07-18T13:36:33+00:00
[INFO] Final Memory: 30M/685M
[INFO] ------------------------------------------------------------------------
[ERROR] Failed to execute goal org.apache.maven.plugins:maven-surefire-plugin:2.16:test (default-test)
on project hadoop-mapreduce-client-app: There are test failures.
[ERROR] 
[ERROR] Please refer to /home/jenkins/jenkins-slave/workspace/Hadoop-Mapreduce-trunk/trunk/hadoop-mapreduce-project/hadoop-mapreduce-client/hadoop-mapreduce-client-app/target/surefire-reports
for the individual test results.
[ERROR] -> [Help 1]
[ERROR] 
[ERROR] To see the full stack trace of the errors, re-run Maven with the -e switch.
[ERROR] Re-run Maven using the -X switch to enable full debug logging.
[ERROR] 
[ERROR] For more information about the errors and possible solutions, please read the following
articles:
[ERROR] [Help 1] http://cwiki.apache.org/confluence/display/MAVEN/MojoFailureException
[ERROR] 
[ERROR] After correcting the problems, you can resume the build with the command
[ERROR]   mvn <goals> -rf :hadoop-mapreduce-client-app
Build step 'Execute shell' marked build as failure
[FINDBUGS] Skipping publisher since build result is FAILURE
Archiving artifacts
Sending artifact delta relative to Hadoop-Mapreduce-trunk #1832
Archived 2 artifacts
Archive block size is 32768
Received 0 blocks and 16962437 bytes
Compression is 0.0%
Took 12 sec
Updating HADOOP-10841
Updating HADOOP-10842
Updating HADOOP-10610
Updating YARN-1341
Updating HADOOP-10591
Updating HADOOP-10733
Updating HDFS-6667
Updating HDFS-6478
Updating HADOOP-10732
Updating HDFS-6693
Updating HDFS-6655
Updating HDFS-4120
Updating MAPREDUCE-5910
Email was triggered for: Failure
Sending email for trigger: Failure



###################################################################################
############################## FAILED TESTS (if any) ##############################
No tests ran.
Mime
  • Unnamed multipart/mixed (inline, None, 0 bytes)
View raw message