hadoop-mapreduce-dev mailing list archives

Site index · List index
Message view « Date » · « Thread »
Top « Date » · « Thread »
From Apache Jenkins Server <jenk...@builds.apache.org>
Subject Hadoop-Mapreduce-trunk - Build # 1915 - Still Failing
Date Fri, 03 Oct 2014 15:11:37 GMT
See https://builds.apache.org/job/Hadoop-Mapreduce-trunk/1915/

###################################################################################
########################## LAST 60 LINES OF THE CONSOLE ###########################
[...truncated 29014 lines...]
Tests run: 508, Failures: 2, Errors: 0, Skipped: 11

[INFO] ------------------------------------------------------------------------
[INFO] Reactor Summary:
[INFO] 
[INFO] hadoop-mapreduce-client ........................... SUCCESS [  2.788 s]
[INFO] hadoop-mapreduce-client-core ...................... SUCCESS [ 58.044 s]
[INFO] hadoop-mapreduce-client-common .................... SUCCESS [ 27.010 s]
[INFO] hadoop-mapreduce-client-shuffle ................... SUCCESS [  4.353 s]
[INFO] hadoop-mapreduce-client-app ....................... SUCCESS [08:49 min]
[INFO] hadoop-mapreduce-client-hs ........................ SUCCESS [05:12 min]
[INFO] hadoop-mapreduce-client-jobclient ................. FAILURE [  01:32 h]
[INFO] hadoop-mapreduce-client-hs-plugins ................ SKIPPED
[INFO] hadoop-mapreduce-client-nativetask ................ SKIPPED
[INFO] Apache Hadoop MapReduce Examples .................. SKIPPED
[INFO] hadoop-mapreduce .................................. SKIPPED
[INFO] ------------------------------------------------------------------------
[INFO] BUILD FAILURE
[INFO] ------------------------------------------------------------------------
[INFO] Total time: 01:48 h
[INFO] Finished at: 2014-10-03T15:11:01+00:00
[INFO] Final Memory: 41M/597M
[INFO] ------------------------------------------------------------------------
[ERROR] Failed to execute goal org.apache.maven.plugins:maven-surefire-plugin:2.16:test (default-test)
on project hadoop-mapreduce-client-jobclient: There are test failures.
[ERROR] 
[ERROR] Please refer to /home/jenkins/jenkins-slave/workspace/Hadoop-Mapreduce-trunk/hadoop-mapreduce-project/hadoop-mapreduce-client/hadoop-mapreduce-client-jobclient/target/surefire-reports
for the individual test results.
[ERROR] -> [Help 1]
[ERROR] 
[ERROR] To see the full stack trace of the errors, re-run Maven with the -e switch.
[ERROR] Re-run Maven using the -X switch to enable full debug logging.
[ERROR] 
[ERROR] For more information about the errors and possible solutions, please read the following
articles:
[ERROR] [Help 1] http://cwiki.apache.org/confluence/display/MAVEN/MojoFailureException
[ERROR] 
[ERROR] After correcting the problems, you can resume the build with the command
[ERROR]   mvn <goals> -rf :hadoop-mapreduce-client-jobclient
Build step 'Execute shell' marked build as failure
[FINDBUGS] Skipping publisher since build result is FAILURE
Archiving artifacts
Sending artifact delta relative to Hadoop-Mapreduce-trunk #1870
Archived 2 artifacts
Archive block size is 32768
Received 0 blocks and 20207893 bytes
Compression is 0.0%
Took 17 sec
Updating HDFS-7178
Updating YARN-2527
Updating YARN-2628
Updating YARN-2254
Updating HDFS-7162
Updating YARN-2617
Updating HADOOP-11160
Updating HDFS-7179
Updating YARN-2624
Updating YARN-1979
Updating HADOOP-11151
Updating HDFS-7181
Email was triggered for: Failure
Sending email for trigger: Failure



###################################################################################
############################## FAILED TESTS (if any) ##############################
No tests ran.
Mime
  • Unnamed multipart/mixed (inline, None, 0 bytes)
View raw message