hadoop-mapreduce-dev mailing list archives

Site index · List index
Message view « Date » · « Thread »
Top « Date » · « Thread »
From Apache Jenkins Server <jenk...@builds.apache.org>
Subject Hadoop-Mapreduce-trunk - Build # 1926 - Still Failing
Date Tue, 14 Oct 2014 15:09:28 GMT
See https://builds.apache.org/job/Hadoop-Mapreduce-trunk/1926/

###################################################################################
########################## LAST 60 LINES OF THE CONSOLE ###########################
[...truncated 30398 lines...]
[INFO] ------------------------------------------------------------------------
[INFO] Reactor Summary:
[INFO] 
[INFO] hadoop-mapreduce-client ........................... SUCCESS [  2.648 s]
[INFO] hadoop-mapreduce-client-core ...................... SUCCESS [ 58.153 s]
[INFO] hadoop-mapreduce-client-common .................... SUCCESS [ 27.193 s]
[INFO] hadoop-mapreduce-client-shuffle ................... SUCCESS [  4.353 s]
[INFO] hadoop-mapreduce-client-app ....................... SUCCESS [08:47 min]
[INFO] hadoop-mapreduce-client-hs ........................ SUCCESS [05:13 min]
[INFO] hadoop-mapreduce-client-jobclient ................. FAILURE [  01:29 h]
[INFO] hadoop-mapreduce-client-hs-plugins ................ SKIPPED
[INFO] hadoop-mapreduce-client-nativetask ................ SKIPPED
[INFO] Apache Hadoop MapReduce Examples .................. SKIPPED
[INFO] hadoop-mapreduce .................................. SKIPPED
[INFO] ------------------------------------------------------------------------
[INFO] BUILD FAILURE
[INFO] ------------------------------------------------------------------------
[INFO] Total time: 01:45 h
[INFO] Finished at: 2014-10-14T15:09:07+00:00
[INFO] Final Memory: 41M/603M
[INFO] ------------------------------------------------------------------------
[ERROR] Failed to execute goal org.apache.maven.plugins:maven-surefire-plugin:2.16:test (default-test)
on project hadoop-mapreduce-client-jobclient: There are test failures.
[ERROR] 
[ERROR] Please refer to /home/jenkins/jenkins-slave/workspace/Hadoop-Mapreduce-trunk/hadoop-mapreduce-project/hadoop-mapreduce-client/hadoop-mapreduce-client-jobclient/target/surefire-reports
for the individual test results.
[ERROR] -> [Help 1]
[ERROR] 
[ERROR] To see the full stack trace of the errors, re-run Maven with the -e switch.
[ERROR] Re-run Maven using the -X switch to enable full debug logging.
[ERROR] 
[ERROR] For more information about the errors and possible solutions, please read the following
articles:
[ERROR] [Help 1] http://cwiki.apache.org/confluence/display/MAVEN/MojoFailureException
[ERROR] 
[ERROR] After correcting the problems, you can resume the build with the command
[ERROR]   mvn <goals> -rf :hadoop-mapreduce-client-jobclient
Build step 'Execute shell' marked build as failure
[FINDBUGS] Skipping publisher since build result is FAILURE
Archiving artifacts
Sending artifact delta relative to Hadoop-Mapreduce-trunk #1870
Archived 2 artifacts
Archive block size is 32768
Received 0 blocks and 20218874 bytes
Compression is 0.0%
Took 9 sec
Updating YARN-2667
Updating YARN-2641
Updating YARN-2651
Updating HDFS-7090
Updating MAPREDUCE-6115
Updating YARN-2308
Updating MAPREDUCE-6125
Updating HDFS-6544
Updating HDFS-7236
Updating YARN-2377
Updating HDFS-7237
Updating YARN-2566
Updating HADOOP-11198
Updating HADOOP-11176
Email was triggered for: Failure
Sending email for trigger: Failure



###################################################################################
############################## FAILED TESTS (if any) ##############################
No tests ran.
Mime
  • Unnamed multipart/mixed (inline, None, 0 bytes)
View raw message