hadoop-mapreduce-dev mailing list archives

Site index · List index
Message view « Date » · « Thread »
Top « Date » · « Thread »
From Apache Jenkins Server <jenk...@builds.apache.org>
Subject Hadoop-Mapreduce-trunk - Build # 1937 - Still Failing
Date Sat, 25 Oct 2014 15:13:44 GMT
See https://builds.apache.org/job/Hadoop-Mapreduce-trunk/1937/

###################################################################################
########################## LAST 60 LINES OF THE CONSOLE ###########################
[...truncated 30426 lines...]
Running org.apache.hadoop.mapred.TestSpecialCharactersInOutputPath
Tests run: 1, Failures: 0, Errors: 0, Skipped: 0, Time elapsed: 25.391 sec - in org.apache.hadoop.mapred.TestSpecialCharactersInOutputPath
Running org.apache.hadoop.mapred.TestSequenceFileAsBinaryOutputFormat
Tests run: 3, Failures: 0, Errors: 0, Skipped: 0, Time elapsed: 1.667 sec - in org.apache.hadoop.mapred.TestSequenceFileAsBinaryOutputFormat

Results :

Failed tests: 
  TestJavaSerialization.testMapReduceJob:127 expected:<[a	]1> but was:<[0	1]1>

Tests run: 515, Failures: 1, Errors: 0, Skipped: 11

[INFO] ------------------------------------------------------------------------
[INFO] Reactor Summary:
[INFO] 
[INFO] hadoop-mapreduce-client ........................... SUCCESS [  2.604 s]
[INFO] hadoop-mapreduce-client-core ...................... SUCCESS [ 58.602 s]
[INFO] hadoop-mapreduce-client-common .................... SUCCESS [ 27.199 s]
[INFO] hadoop-mapreduce-client-shuffle ................... SUCCESS [  4.358 s]
[INFO] hadoop-mapreduce-client-app ....................... SUCCESS [08:44 min]
[INFO] hadoop-mapreduce-client-hs ........................ SUCCESS [05:12 min]
[INFO] hadoop-mapreduce-client-jobclient ................. FAILURE [  01:33 h]
[INFO] hadoop-mapreduce-client-hs-plugins ................ SKIPPED
[INFO] hadoop-mapreduce-client-nativetask ................ SKIPPED
[INFO] Apache Hadoop MapReduce Examples .................. SKIPPED
[INFO] hadoop-mapreduce .................................. SKIPPED
[INFO] ------------------------------------------------------------------------
[INFO] BUILD FAILURE
[INFO] ------------------------------------------------------------------------
[INFO] Total time: 01:49 h
[INFO] Finished at: 2014-10-25T15:13:30+00:00
[INFO] Final Memory: 40M/607M
[INFO] ------------------------------------------------------------------------
[ERROR] Failed to execute goal org.apache.maven.plugins:maven-surefire-plugin:2.16:test (default-test)
on project hadoop-mapreduce-client-jobclient: There are test failures.
[ERROR] 
[ERROR] Please refer to /home/jenkins/jenkins-slave/workspace/Hadoop-Mapreduce-trunk/hadoop-mapreduce-project/hadoop-mapreduce-client/hadoop-mapreduce-client-jobclient/target/surefire-reports
for the individual test results.
[ERROR] -> [Help 1]
[ERROR] 
[ERROR] To see the full stack trace of the errors, re-run Maven with the -e switch.
[ERROR] Re-run Maven using the -X switch to enable full debug logging.
[ERROR] 
[ERROR] For more information about the errors and possible solutions, please read the following
articles:
[ERROR] [Help 1] http://cwiki.apache.org/confluence/display/MAVEN/MojoFailureException
[ERROR] 
[ERROR] After correcting the problems, you can resume the build with the command
[ERROR]   mvn <goals> -rf :hadoop-mapreduce-client-jobclient
Build step 'Execute shell' marked build as failure
[FINDBUGS] Skipping publisher since build result is FAILURE
Archiving artifacts
Sending artifact delta relative to Hadoop-Mapreduce-trunk #1870
Archived 2 artifacts
Archive block size is 32768
Received 0 blocks and 20224665 bytes
Compression is 0.0%
Took 9.9 sec
Error updating JIRA issues. Saving issues for next build.
com.atlassian.jira.rpc.exception.RemotePermissionException: This issue does not exist or you
don't have permission to view it.
Email was triggered for: Failure
Sending email for trigger: Failure



###################################################################################
############################## FAILED TESTS (if any) ##############################
No tests ran.
Mime
  • Unnamed multipart/mixed (inline, None, 0 bytes)
View raw message