hadoop-mapreduce-dev mailing list archives

Site index · List index
Message view « Date » · « Thread »
Top « Date » · « Thread »
From Apache Jenkins Server <jenk...@builds.apache.org>
Subject Hadoop-Mapreduce-trunk - Build # 2046 - Still Failing
Date Thu, 05 Feb 2015 15:25:01 GMT
See https://builds.apache.org/job/Hadoop-Mapreduce-trunk/2046/

###################################################################################
########################## LAST 60 LINES OF THE CONSOLE ###########################
[...truncated 31095 lines...]
[INFO] hadoop-mapreduce-client-app ....................... SUCCESS [10:01 min]
[INFO] hadoop-mapreduce-client-hs ........................ SUCCESS [05:29 min]
[INFO] hadoop-mapreduce-client-jobclient ................. FAILURE [  01:41 h]
[INFO] hadoop-mapreduce-client-hs-plugins ................ SKIPPED
[INFO] hadoop-mapreduce-client-nativetask ................ SKIPPED
[INFO] Apache Hadoop MapReduce Examples .................. SKIPPED
[INFO] hadoop-mapreduce .................................. SKIPPED
[INFO] ------------------------------------------------------------------------
[INFO] BUILD FAILURE
[INFO] ------------------------------------------------------------------------
[INFO] Total time: 01:59 h
[INFO] Finished at: 2015-02-05T15:24:40+00:00
[INFO] Final Memory: 33M/724M
[INFO] ------------------------------------------------------------------------
[ERROR] Failed to execute goal org.apache.maven.plugins:maven-surefire-plugin:2.17:test (default-test)
on project hadoop-mapreduce-client-jobclient: There are test failures.
[ERROR] 
[ERROR] Please refer to /home/jenkins/jenkins-slave/workspace/Hadoop-Mapreduce-trunk/hadoop-mapreduce-project/hadoop-mapreduce-client/hadoop-mapreduce-client-jobclient/target/surefire-reports
for the individual test results.
[ERROR] -> [Help 1]
[ERROR] 
[ERROR] To see the full stack trace of the errors, re-run Maven with the -e switch.
[ERROR] Re-run Maven using the -X switch to enable full debug logging.
[ERROR] 
[ERROR] For more information about the errors and possible solutions, please read the following
articles:
[ERROR] [Help 1] http://cwiki.apache.org/confluence/display/MAVEN/MojoFailureException
[ERROR] 
[ERROR] After correcting the problems, you can resume the build with the command
[ERROR]   mvn <goals> -rf :hadoop-mapreduce-client-jobclient
Build step 'Execute shell' marked build as failure
[FINDBUGS] Skipping publisher since build result is FAILURE
Archiving artifacts
Sending artifact delta relative to Hadoop-Mapreduce-trunk #2031
Archived 1 artifacts
Archive block size is 32768
Received 0 blocks and 20299083 bytes
Compression is 0.0%
Took 5.2 sec
Recording test results
Updating HADOOP-10062
Updating YARN-1723
Updating HADOOP-11543
Updating MAPREDUCE-6243
Updating HADOOP-11546
Updating HADOOP-11548
Updating MAPREDUCE-5988
Updating HADOOP-11547
Updating HADOOP-11492
Updating HADOOP-11549
Updating HDFS-7709
Updating HADOOP-10976
Updating YARN-3123
Updating HADOOP-11463
Updating HDFS-7733
Updating MAPREDUCE-6059
Updating HDFS-7734
Updating HADOOP-11460
Updating HADOOP-11346
Updating HDFS-7719
Email was triggered for: Failure
Sending email for trigger: Failure



###################################################################################
############################## FAILED TESTS (if any) ##############################
2 tests failed.
FAILED:  org.apache.hadoop.conf.TestJobConf.testNegativeValueForTaskVmem

Error Message:
expected:<1024> but was:<-1>

Stack Trace:
java.lang.AssertionError: expected:<1024> but was:<-1>
	at org.junit.Assert.fail(Assert.java:88)
	at org.junit.Assert.failNotEquals(Assert.java:743)
	at org.junit.Assert.assertEquals(Assert.java:118)
	at org.junit.Assert.assertEquals(Assert.java:555)
	at org.junit.Assert.assertEquals(Assert.java:542)
	at org.apache.hadoop.conf.TestJobConf.testNegativeValueForTaskVmem(TestJobConf.java:111)


FAILED:  org.apache.hadoop.mapreduce.TestLargeSort.testLargeSort

Error Message:
Large sort failed for 128 expected:<0> but was:<1>

Stack Trace:
java.lang.AssertionError: Large sort failed for 128 expected:<0> but was:<1>
	at org.junit.Assert.fail(Assert.java:88)
	at org.junit.Assert.failNotEquals(Assert.java:743)
	at org.junit.Assert.assertEquals(Assert.java:118)
	at org.junit.Assert.assertEquals(Assert.java:555)
	at org.apache.hadoop.mapreduce.TestLargeSort.testLargeSort(TestLargeSort.java:61)



Mime
  • Unnamed multipart/mixed (inline, None, 0 bytes)
View raw message