hadoop-mapreduce-dev mailing list archives

Site index · List index
Message view « Date » · « Thread »
Top « Date » · « Thread »
From Apache Jenkins Server <jenk...@builds.apache.org>
Subject Hadoop-Mapreduce-trunk - Build # 2050 - Still Failing
Date Mon, 09 Feb 2015 23:21:54 GMT
See https://builds.apache.org/job/Hadoop-Mapreduce-trunk/2050/

###################################################################################
########################## LAST 60 LINES OF THE CONSOLE ###########################
[...truncated 31087 lines...]

Results :

Failed tests: 
  TestJobConf.testNegativeValueForTaskVmem:111 expected:<1024> but was:<-1>

Tests run: 520, Failures: 1, Errors: 0, Skipped: 11

[INFO] ------------------------------------------------------------------------
[INFO] Reactor Summary:
[INFO] 
[INFO] hadoop-mapreduce-client ........................... SUCCESS [  2.704 s]
[INFO] hadoop-mapreduce-client-core ...................... SUCCESS [01:20 min]
[INFO] hadoop-mapreduce-client-common .................... SUCCESS [ 27.636 s]
[INFO] hadoop-mapreduce-client-shuffle ................... SUCCESS [  4.604 s]
[INFO] hadoop-mapreduce-client-app ....................... SUCCESS [09:28 min]
[INFO] hadoop-mapreduce-client-hs ........................ SUCCESS [05:20 min]
[INFO] hadoop-mapreduce-client-jobclient ................. FAILURE [  01:42 h]
[INFO] hadoop-mapreduce-client-hs-plugins ................ SKIPPED
[INFO] hadoop-mapreduce-client-nativetask ................ SKIPPED
[INFO] Apache Hadoop MapReduce Examples .................. SKIPPED
[INFO] hadoop-mapreduce .................................. SKIPPED
[INFO] ------------------------------------------------------------------------
[INFO] BUILD FAILURE
[INFO] ------------------------------------------------------------------------
[INFO] Total time: 01:59 h
[INFO] Finished at: 2015-02-09T23:21:22+00:00
[INFO] Final Memory: 33M/779M
[INFO] ------------------------------------------------------------------------
[ERROR] Failed to execute goal org.apache.maven.plugins:maven-surefire-plugin:2.17:test (default-test)
on project hadoop-mapreduce-client-jobclient: There are test failures.
[ERROR] 
[ERROR] Please refer to /home/jenkins/jenkins-slave/workspace/Hadoop-Mapreduce-trunk/hadoop-mapreduce-project/hadoop-mapreduce-client/hadoop-mapreduce-client-jobclient/target/surefire-reports
for the individual test results.
[ERROR] -> [Help 1]
[ERROR] 
[ERROR] To see the full stack trace of the errors, re-run Maven with the -e switch.
[ERROR] Re-run Maven using the -X switch to enable full debug logging.
[ERROR] 
[ERROR] For more information about the errors and possible solutions, please read the following
articles:
[ERROR] [Help 1] http://cwiki.apache.org/confluence/display/MAVEN/MojoFailureException
[ERROR] 
[ERROR] After correcting the problems, you can resume the build with the command
[ERROR]   mvn <goals> -rf :hadoop-mapreduce-client-jobclient
Build step 'Execute shell' marked build as failure
[FINDBUGS] Skipping publisher since build result is FAILURE
Archiving artifacts
Sending artifact delta relative to Hadoop-Mapreduce-trunk #2031
Archived 1 artifacts
Archive block size is 32768
Received 0 blocks and 20298771 bytes
Compression is 0.0%
Took 6.6 sec
Recording test results
Updating HDFS-7647
Updating YARN-2990
Updating HADOOP-8934
Updating HDFS-7670
Updating MAPREDUCE-6237
Email was triggered for: Failure
Sending email for trigger: Failure



###################################################################################
############################## FAILED TESTS (if any) ##############################
1 tests failed.
FAILED:  org.apache.hadoop.conf.TestJobConf.testNegativeValueForTaskVmem

Error Message:
expected:<1024> but was:<-1>

Stack Trace:
java.lang.AssertionError: expected:<1024> but was:<-1>
	at org.junit.Assert.fail(Assert.java:88)
	at org.junit.Assert.failNotEquals(Assert.java:743)
	at org.junit.Assert.assertEquals(Assert.java:118)
	at org.junit.Assert.assertEquals(Assert.java:555)
	at org.junit.Assert.assertEquals(Assert.java:542)
	at org.apache.hadoop.conf.TestJobConf.testNegativeValueForTaskVmem(TestJobConf.java:111)



Mime
  • Unnamed multipart/mixed (inline, None, 0 bytes)
View raw message