hadoop-mapreduce-dev mailing list archives

Site index · List index
Message view « Date » · « Thread »
Top « Date » · « Thread »
From Apache Jenkins Server <jenk...@builds.apache.org>
Subject Hadoop-Mapreduce-trunk-Java8 - Build # 97 - Still Failing
Date Fri, 06 Feb 2015 15:03:53 GMT
See https://builds.apache.org/job/Hadoop-Mapreduce-trunk-Java8/97/

###################################################################################
########################## LAST 60 LINES OF THE CONSOLE ###########################
[...truncated 10590 lines...]
[INFO] hadoop-mapreduce-client-common .................... SUCCESS [ 23.757 s]
[INFO] hadoop-mapreduce-client-shuffle ................... SUCCESS [  3.814 s]
[INFO] hadoop-mapreduce-client-app ....................... SUCCESS [10:19 min]
[INFO] hadoop-mapreduce-client-hs ........................ SUCCESS [05:51 min]
[INFO] hadoop-mapreduce-client-jobclient ................. FAILURE [  01:38 h]
[INFO] hadoop-mapreduce-client-hs-plugins ................ SKIPPED
[INFO] hadoop-mapreduce-client-nativetask ................ SKIPPED
[INFO] Apache Hadoop MapReduce Examples .................. SKIPPED
[INFO] hadoop-mapreduce .................................. SKIPPED
[INFO] ------------------------------------------------------------------------
[INFO] BUILD FAILURE
[INFO] ------------------------------------------------------------------------
[INFO] Total time: 01:56 h
[INFO] Finished at: 2015-02-06T15:03:33+00:00
[INFO] Final Memory: 34M/162M
[INFO] ------------------------------------------------------------------------
[ERROR] Failed to execute goal org.apache.maven.plugins:maven-surefire-plugin:2.17:test (default-test)
on project hadoop-mapreduce-client-jobclient: There are test failures.
[ERROR] 
[ERROR] Please refer to /home/jenkins/jenkins-slave/workspace/Hadoop-Mapreduce-trunk-Java8/hadoop-mapreduce-project/hadoop-mapreduce-client/hadoop-mapreduce-client-jobclient/target/surefire-reports
for the individual test results.
[ERROR] -> [Help 1]
[ERROR] 
[ERROR] To see the full stack trace of the errors, re-run Maven with the -e switch.
[ERROR] Re-run Maven using the -X switch to enable full debug logging.
[ERROR] 
[ERROR] For more information about the errors and possible solutions, please read the following
articles:
[ERROR] [Help 1] http://cwiki.apache.org/confluence/display/MAVEN/MojoFailureException
[ERROR] 
[ERROR] After correcting the problems, you can resume the build with the command
[ERROR]   mvn <goals> -rf :hadoop-mapreduce-client-jobclient
Build step 'Execute shell' marked build as failure
[FINDBUGS] Skipping publisher since build result is FAILURE
Archiving artifacts
Sending artifact delta relative to Hadoop-Mapreduce-trunk-Java8 #28
Archived 1 artifacts
Archive block size is 32768
Received 0 blocks and 20303804 bytes
Compression is 0.0%
Took 5.7 sec
Recording test results
Updating HADOOP-6964
Updating MAPREDUCE-6233
Updating HADOOP-11543
Updating YARN-1582
Updating YARN-1537
Updating HADOOP-7713
Updating YARN-3101
Updating HDFS-7741
Updating HADOOP-9044
Updating YARN-3145
Updating YARN-1904
Updating HDFS-7270
Updating MAPREDUCE-6186
Updating YARN-3149
Updating HDFS-7655
Updating HADOOP-11506
Updating HADOOP-11526
Updating HDFS-7698
Email was triggered for: Failure
Sending email for trigger: Failure



###################################################################################
############################## FAILED TESTS (if any) ##############################
3 tests failed.
FAILED:  org.apache.hadoop.conf.TestJobConf.testNegativeValueForTaskVmem

Error Message:
expected:<1024> but was:<-1>

Stack Trace:
java.lang.AssertionError: expected:<1024> but was:<-1>
	at org.junit.Assert.fail(Assert.java:88)
	at org.junit.Assert.failNotEquals(Assert.java:743)
	at org.junit.Assert.assertEquals(Assert.java:118)
	at org.junit.Assert.assertEquals(Assert.java:555)
	at org.junit.Assert.assertEquals(Assert.java:542)
	at org.apache.hadoop.conf.TestJobConf.testNegativeValueForTaskVmem(TestJobConf.java:111)


FAILED:  org.apache.hadoop.mapreduce.lib.input.TestCombineFileInputFormat.testSplitPlacementForCompressedFiles

Error Message:
expected:<2> but was:<1>

Stack Trace:
junit.framework.AssertionFailedError: expected:<2> but was:<1>
	at junit.framework.Assert.fail(Assert.java:57)
	at junit.framework.Assert.failNotEquals(Assert.java:329)
	at junit.framework.Assert.assertEquals(Assert.java:78)
	at junit.framework.Assert.assertEquals(Assert.java:234)
	at junit.framework.Assert.assertEquals(Assert.java:241)
	at junit.framework.TestCase.assertEquals(TestCase.java:409)
	at org.apache.hadoop.mapreduce.lib.input.TestCombineFileInputFormat.testSplitPlacementForCompressedFiles(TestCombineFileInputFormat.java:911)


FAILED:  org.apache.hadoop.mapreduce.lib.input.TestCombineFileInputFormat.testSplitPlacement

Error Message:
expected:<2> but was:<1>

Stack Trace:
junit.framework.AssertionFailedError: expected:<2> but was:<1>
	at junit.framework.Assert.fail(Assert.java:57)
	at junit.framework.Assert.failNotEquals(Assert.java:329)
	at junit.framework.Assert.assertEquals(Assert.java:78)
	at junit.framework.Assert.assertEquals(Assert.java:234)
	at junit.framework.Assert.assertEquals(Assert.java:241)
	at junit.framework.TestCase.assertEquals(TestCase.java:409)
	at org.apache.hadoop.mapreduce.lib.input.TestCombineFileInputFormat.testSplitPlacement(TestCombineFileInputFormat.java:368)



Mime
  • Unnamed multipart/mixed (inline, None, 0 bytes)
View raw message