hadoop-mapreduce-dev mailing list archives

Site index · List index
Message view « Date » · « Thread »
Top « Date » · « Thread »
From Apache Jenkins Server <jenk...@builds.apache.org>
Subject Hadoop-Mapreduce-trunk - Build # 2058 - Still Failing
Date Tue, 17 Feb 2015 15:24:28 GMT
See https://builds.apache.org/job/Hadoop-Mapreduce-trunk/2058/

###################################################################################
########################## LAST 60 LINES OF THE CONSOLE ###########################
[...truncated 31131 lines...]

Failed tests: 
  TestJobConf.testNegativeValueForTaskVmem:111 expected:<1024> but was:<-1>

Tests run: 520, Failures: 1, Errors: 0, Skipped: 11

[INFO] ------------------------------------------------------------------------
[INFO] Reactor Summary:
[INFO] 
[INFO] hadoop-mapreduce-client ........................... SUCCESS [  2.834 s]
[INFO] hadoop-mapreduce-client-core ...................... SUCCESS [01:19 min]
[INFO] hadoop-mapreduce-client-common .................... SUCCESS [ 27.040 s]
[INFO] hadoop-mapreduce-client-shuffle ................... SUCCESS [  4.658 s]
[INFO] hadoop-mapreduce-client-app ....................... SUCCESS [08:48 min]
[INFO] hadoop-mapreduce-client-hs ........................ SUCCESS [05:25 min]
[INFO] hadoop-mapreduce-client-jobclient ................. FAILURE [  01:41 h]
[INFO] hadoop-mapreduce-client-hs-plugins ................ SKIPPED
[INFO] hadoop-mapreduce-client-nativetask ................ SKIPPED
[INFO] Apache Hadoop MapReduce Examples .................. SKIPPED
[INFO] hadoop-mapreduce .................................. SKIPPED
[INFO] ------------------------------------------------------------------------
[INFO] BUILD FAILURE
[INFO] ------------------------------------------------------------------------
[INFO] Total time: 01:58 h
[INFO] Finished at: 2015-02-17T15:24:07+00:00
[INFO] Final Memory: 36M/623M
[INFO] ------------------------------------------------------------------------
[ERROR] Failed to execute goal org.apache.maven.plugins:maven-surefire-plugin:2.17:test (default-test)
on project hadoop-mapreduce-client-jobclient: There are test failures.
[ERROR] 
[ERROR] Please refer to /home/jenkins/jenkins-slave/workspace/Hadoop-Mapreduce-trunk/hadoop-mapreduce-project/hadoop-mapreduce-client/hadoop-mapreduce-client-jobclient/target/surefire-reports
for the individual test results.
[ERROR] -> [Help 1]
[ERROR] 
[ERROR] To see the full stack trace of the errors, re-run Maven with the -e switch.
[ERROR] Re-run Maven using the -X switch to enable full debug logging.
[ERROR] 
[ERROR] For more information about the errors and possible solutions, please read the following
articles:
[ERROR] [Help 1] http://cwiki.apache.org/confluence/display/MAVEN/MojoFailureException
[ERROR] 
[ERROR] After correcting the problems, you can resume the build with the command
[ERROR]   mvn <goals> -rf :hadoop-mapreduce-client-jobclient
Build step 'Execute shell' marked build as failure
[FINDBUGS] Skipping publisher since build result is FAILURE
Archiving artifacts
Sending artifact delta relative to Hadoop-Mapreduce-trunk #2031
Archived 1 artifacts
Archive block size is 32768
Received 0 blocks and 20297824 bytes
Compression is 0.0%
Took 5.9 sec
Recording test results
Updating HADOOP-11600
Updating YARN-3203
Updating HADOOP-11000
Updating HDFS-7798
Updating YARN-1299
Updating HDFS-7604
Updating MAPREDUCE-6225
Email was triggered for: Failure
Sending email for trigger: Failure



###################################################################################
############################## FAILED TESTS (if any) ##############################
1 tests failed.
FAILED:  org.apache.hadoop.conf.TestJobConf.testNegativeValueForTaskVmem

Error Message:
expected:<1024> but was:<-1>

Stack Trace:
java.lang.AssertionError: expected:<1024> but was:<-1>
	at org.junit.Assert.fail(Assert.java:88)
	at org.junit.Assert.failNotEquals(Assert.java:743)
	at org.junit.Assert.assertEquals(Assert.java:118)
	at org.junit.Assert.assertEquals(Assert.java:555)
	at org.junit.Assert.assertEquals(Assert.java:542)
	at org.apache.hadoop.conf.TestJobConf.testNegativeValueForTaskVmem(TestJobConf.java:111)



Mime
  • Unnamed multipart/mixed (inline, None, 0 bytes)
View raw message