hadoop-mapreduce-dev mailing list archives

Site index · List index
Message view « Date » · « Thread »
Top « Date » · « Thread »
From Apache Jenkins Server <jenk...@builds.apache.org>
Subject Hadoop-Mapreduce-trunk-Java8 - Build # 137 - Still Failing
Date Thu, 19 Mar 2015 15:12:08 GMT
See https://builds.apache.org/job/Hadoop-Mapreduce-trunk-Java8/137/

###################################################################################
########################## LAST 60 LINES OF THE CONSOLE ###########################
[...truncated 10674 lines...]
[INFO] hadoop-mapreduce-client-shuffle ................... SUCCESS [  4.003 s]
[INFO] hadoop-mapreduce-client-app ....................... SUCCESS [12:03 min]
[INFO] hadoop-mapreduce-client-hs ........................ SUCCESS [06:32 min]
[INFO] hadoop-mapreduce-client-jobclient ................. FAILURE [  01:44 h]
[INFO] hadoop-mapreduce-client-hs-plugins ................ SKIPPED
[INFO] hadoop-mapreduce-client-nativetask ................ SKIPPED
[INFO] Apache Hadoop MapReduce Examples .................. SKIPPED
[INFO] hadoop-mapreduce .................................. SKIPPED
[INFO] ------------------------------------------------------------------------
[INFO] BUILD FAILURE
[INFO] ------------------------------------------------------------------------
[INFO] Total time: 02:04 h
[INFO] Finished at: 2015-03-19T15:11:36+00:00
[INFO] Final Memory: 34M/181M
[INFO] ------------------------------------------------------------------------
[ERROR] Failed to execute goal org.apache.maven.plugins:maven-surefire-plugin:2.17:test (default-test)
on project hadoop-mapreduce-client-jobclient: There are test failures.
[ERROR] 
[ERROR] Please refer to /home/jenkins/jenkins-slave/workspace/Hadoop-Mapreduce-trunk-Java8/hadoop-mapreduce-project/hadoop-mapreduce-client/hadoop-mapreduce-client-jobclient/target/surefire-reports
for the individual test results.
[ERROR] -> [Help 1]
[ERROR] 
[ERROR] To see the full stack trace of the errors, re-run Maven with the -e switch.
[ERROR] Re-run Maven using the -X switch to enable full debug logging.
[ERROR] 
[ERROR] For more information about the errors and possible solutions, please read the following
articles:
[ERROR] [Help 1] http://cwiki.apache.org/confluence/display/MAVEN/MojoFailureException
[ERROR] 
[ERROR] After correcting the problems, you can resume the build with the command
[ERROR]   mvn <goals> -rf :hadoop-mapreduce-client-jobclient
Build step 'Execute shell' marked build as failure
[FINDBUGS] Skipping publisher since build result is FAILURE
Archiving artifacts
Sending artifact delta relative to Hadoop-Mapreduce-trunk-Java8 #28
Archived 1 artifacts
Archive block size is 32768
Received 0 blocks and 20331109 bytes
Compression is 0.0%
Took 7.7 sec
Recording test results
Updating HDFS-7929
Updating HDFS-7948
Updating HDFS-7953
Updating HDFS-7951
Updating HDFS-7950
Updating HDFS-7914
Updating HADOOP-10703
Updating MAPREDUCE-6277
Updating HDFS-7054
Updating HDFS-7943
Updating HADOOP-9329
Updating HDFS-7945
Updating HDFS-7869
Updating HDFS-7722
Updating YARN-3351
Updating HDFS-7587
Updating HDFS-7697
Updating HDFS-7867
Updating YARN-3357
Email was triggered for: Failure
Sending email for trigger: Failure



###################################################################################
############################## FAILED TESTS (if any) ##############################
2 tests failed.
FAILED:  org.apache.hadoop.mapreduce.lib.input.TestCombineFileInputFormat.testSplitPlacementForCompressedFiles

Error Message:
expected:<2> but was:<1>

Stack Trace:
junit.framework.AssertionFailedError: expected:<2> but was:<1>
	at junit.framework.Assert.fail(Assert.java:57)
	at junit.framework.Assert.failNotEquals(Assert.java:329)
	at junit.framework.Assert.assertEquals(Assert.java:78)
	at junit.framework.Assert.assertEquals(Assert.java:234)
	at junit.framework.Assert.assertEquals(Assert.java:241)
	at junit.framework.TestCase.assertEquals(TestCase.java:409)
	at org.apache.hadoop.mapreduce.lib.input.TestCombineFileInputFormat.testSplitPlacementForCompressedFiles(TestCombineFileInputFormat.java:911)


FAILED:  org.apache.hadoop.mapreduce.lib.input.TestCombineFileInputFormat.testSplitPlacement

Error Message:
expected:<2> but was:<1>

Stack Trace:
junit.framework.AssertionFailedError: expected:<2> but was:<1>
	at junit.framework.Assert.fail(Assert.java:57)
	at junit.framework.Assert.failNotEquals(Assert.java:329)
	at junit.framework.Assert.assertEquals(Assert.java:78)
	at junit.framework.Assert.assertEquals(Assert.java:234)
	at junit.framework.Assert.assertEquals(Assert.java:241)
	at junit.framework.TestCase.assertEquals(TestCase.java:409)
	at org.apache.hadoop.mapreduce.lib.input.TestCombineFileInputFormat.testSplitPlacement(TestCombineFileInputFormat.java:368)



Mime
  • Unnamed multipart/mixed (inline, None, 0 bytes)
View raw message