hadoop-mapreduce-dev mailing list archives

Site index · List index
Message view « Date » · « Thread »
Top « Date » · « Thread »
From Apache Jenkins Server <jenk...@builds.apache.org>
Subject Hadoop-Mapreduce-trunk - Build # 2073 - Failure
Date Thu, 05 Mar 2015 15:50:12 GMT
See https://builds.apache.org/job/Hadoop-Mapreduce-trunk/2073/

###################################################################################
########################## LAST 60 LINES OF THE CONSOLE ###########################
[...truncated 31198 lines...]
Tests run: 520, Failures: 0, Errors: 1, Skipped: 11

[INFO] ------------------------------------------------------------------------
[INFO] Reactor Summary:
[INFO] 
[INFO] hadoop-mapreduce-client ........................... SUCCESS [  2.659 s]
[INFO] hadoop-mapreduce-client-core ...................... SUCCESS [01:32 min]
[INFO] hadoop-mapreduce-client-common .................... SUCCESS [ 27.780 s]
[INFO] hadoop-mapreduce-client-shuffle ................... SUCCESS [  4.589 s]
[INFO] hadoop-mapreduce-client-app ....................... SUCCESS [11:21 min]
[INFO] hadoop-mapreduce-client-hs ........................ SUCCESS [05:37 min]
[INFO] hadoop-mapreduce-client-jobclient ................. FAILURE [  01:58 h]
[INFO] hadoop-mapreduce-client-hs-plugins ................ SKIPPED
[INFO] hadoop-mapreduce-client-nativetask ................ SKIPPED
[INFO] Apache Hadoop MapReduce Examples .................. SKIPPED
[INFO] hadoop-mapreduce .................................. SKIPPED
[INFO] ------------------------------------------------------------------------
[INFO] BUILD FAILURE
[INFO] ------------------------------------------------------------------------
[INFO] Total time: 02:17 h
[INFO] Finished at: 2015-03-05T15:44:04+00:00
[INFO] Final Memory: 34M/760M
[INFO] ------------------------------------------------------------------------
[ERROR] Failed to execute goal org.apache.maven.plugins:maven-surefire-plugin:2.17:test (default-test)
on project hadoop-mapreduce-client-jobclient: There was a timeout or other error in the fork
-> [Help 1]
[ERROR] 
[ERROR] To see the full stack trace of the errors, re-run Maven with the -e switch.
[ERROR] Re-run Maven using the -X switch to enable full debug logging.
[ERROR] 
[ERROR] For more information about the errors and possible solutions, please read the following
articles:
[ERROR] [Help 1] http://cwiki.apache.org/confluence/display/MAVEN/MojoFailureException
[ERROR] 
[ERROR] After correcting the problems, you can resume the build with the command
[ERROR]   mvn <goals> -rf :hadoop-mapreduce-client-jobclient
Build step 'Execute shell' marked build as failure
[FINDBUGS] Skipping publisher since build result is FAILURE
Archiving artifacts
Sending artifact delta relative to Hadoop-Mapreduce-trunk #2072
Archived 1 artifacts
Archive block size is 32768
Received 0 blocks and 20312860 bytes
Compression is 0.0%
Took 5 min 11 sec
Recording test results
Updating YARN-3242
Updating HDFS-7434
Updating HDFS-7879
Updating HADOOP-11648
Updating MAPREDUCE-6267
Updating YARN-3249
Updating MAPREDUCE-6136
Updating HADOOP-11674
Updating HDFS-7746
Updating HDFS-7535
Updating YARN-3131
Updating YARN-3122
Updating YARN-3231
Updating HDFS-1522
Email was triggered for: Failure
Sending email for trigger: Failure



###################################################################################
############################## FAILED TESTS (if any) ##############################
1 tests failed.
REGRESSION:  org.apache.hadoop.mapred.TestMRTimelineEventHandling.testMapreduceJobTimelineServiceEnabled

Error Message:
Job didn't finish in 30 seconds

Stack Trace:
java.io.IOException: Job didn't finish in 30 seconds
	at org.apache.hadoop.mapred.UtilsForTests.runJobSucceed(UtilsForTests.java:622)
	at org.apache.hadoop.mapred.TestMRTimelineEventHandling.testMapreduceJobTimelineServiceEnabled(TestMRTimelineEventHandling.java:155)



Mime
  • Unnamed multipart/mixed (inline, None, 0 bytes)
View raw message