hadoop-mapreduce-dev mailing list archives

Site index · List index
Message view « Date » · « Thread »
Top « Date » · « Thread »
From Apache Jenkins Server <jenk...@builds.apache.org>
Subject Hadoop-Mapreduce-trunk-Java8 - Build # 146 - Still Failing
Date Sat, 28 Mar 2015 13:20:00 GMT
See https://builds.apache.org/job/Hadoop-Mapreduce-trunk-Java8/146/

###################################################################################
########################## LAST 60 LINES OF THE CONSOLE ###########################
[...truncated 9932 lines...]

Tests in error: 
  TestJobHistoryEventHandler.testTimelineEventHandling:458 ยป YarnRuntime java.io...

Tests run: 293, Failures: 0, Errors: 1, Skipped: 0

[INFO] ------------------------------------------------------------------------
[INFO] Reactor Summary:
[INFO] 
[INFO] hadoop-mapreduce-client ........................... SUCCESS [  2.109 s]
[INFO] hadoop-mapreduce-client-core ...................... SUCCESS [01:36 min]
[INFO] hadoop-mapreduce-client-common .................... SUCCESS [ 25.876 s]
[INFO] hadoop-mapreduce-client-shuffle ................... SUCCESS [  3.958 s]
[INFO] hadoop-mapreduce-client-app ....................... FAILURE [10:23 min]
[INFO] hadoop-mapreduce-client-hs ........................ SKIPPED
[INFO] hadoop-mapreduce-client-jobclient ................. SKIPPED
[INFO] hadoop-mapreduce-client-hs-plugins ................ SKIPPED
[INFO] hadoop-mapreduce-client-nativetask ................ SKIPPED
[INFO] Apache Hadoop MapReduce Examples .................. SKIPPED
[INFO] hadoop-mapreduce .................................. SKIPPED
[INFO] ------------------------------------------------------------------------
[INFO] BUILD FAILURE
[INFO] ------------------------------------------------------------------------
[INFO] Total time: 12:32 min
[INFO] Finished at: 2015-03-28T13:19:44+00:00
[INFO] Final Memory: 40M/247M
[INFO] ------------------------------------------------------------------------
[ERROR] Failed to execute goal org.apache.maven.plugins:maven-surefire-plugin:2.17:test (default-test)
on project hadoop-mapreduce-client-app: There are test failures.
[ERROR] 
[ERROR] Please refer to /home/jenkins/jenkins-slave/workspace/Hadoop-Mapreduce-trunk-Java8/hadoop-mapreduce-project/hadoop-mapreduce-client/hadoop-mapreduce-client-app/target/surefire-reports
for the individual test results.
[ERROR] -> [Help 1]
[ERROR] 
[ERROR] To see the full stack trace of the errors, re-run Maven with the -e switch.
[ERROR] Re-run Maven using the -X switch to enable full debug logging.
[ERROR] 
[ERROR] For more information about the errors and possible solutions, please read the following
articles:
[ERROR] [Help 1] http://cwiki.apache.org/confluence/display/MAVEN/MojoFailureException
[ERROR] 
[ERROR] After correcting the problems, you can resume the build with the command
[ERROR]   mvn <goals> -rf :hadoop-mapreduce-client-app
Build step 'Execute shell' marked build as failure
[FINDBUGS] Skipping publisher since build result is FAILURE
Archiving artifacts
Sending artifact delta relative to Hadoop-Mapreduce-trunk-Java8 #28
Archived 1 artifacts
Archive block size is 32768
Received 0 blocks and 20335795 bytes
Compression is 0.0%
Took 9.9 sec
Recording test results
Updating HADOOP-11639
Updating MAPREDUCE-6291
Updating HDFS-8004
Updating HADOOP-11760
Updating HDFS-7700
Updating MAPREDUCE-6294
Updating HDFS-7990
Email was triggered for: Failure
Sending email for trigger: Failure



###################################################################################
############################## FAILED TESTS (if any) ##############################
1 tests failed.
FAILED:  org.apache.hadoop.mapreduce.jobhistory.TestJobHistoryEventHandler.testTimelineEventHandling

Error Message:
java.io.IOException: ResourceManager failed to start. Final state is STOPPED

Stack Trace:
org.apache.hadoop.yarn.exceptions.YarnRuntimeException: java.io.IOException: ResourceManager
failed to start. Final state is STOPPED
	at org.apache.hadoop.yarn.server.MiniYARNCluster.startResourceManager(MiniYARNCluster.java:327)
	at org.apache.hadoop.yarn.server.MiniYARNCluster.access$500(MiniYARNCluster.java:97)
	at org.apache.hadoop.yarn.server.MiniYARNCluster$ResourceManagerWrapper.serviceStart(MiniYARNCluster.java:450)
	at org.apache.hadoop.service.AbstractService.start(AbstractService.java:193)
	at org.apache.hadoop.service.CompositeService.serviceStart(CompositeService.java:120)
	at org.apache.hadoop.service.AbstractService.start(AbstractService.java:193)
	at org.apache.hadoop.mapreduce.jobhistory.TestJobHistoryEventHandler.testTimelineEventHandling(TestJobHistoryEventHandler.java:458)



Mime
  • Unnamed multipart/mixed (inline, None, 0 bytes)
View raw message