hadoop-mapreduce-dev mailing list archives

Site index · List index
Message view « Date » · « Thread »
Top « Date » · « Thread »
From Apache Jenkins Server <jenk...@builds.apache.org>
Subject Hadoop-Mapreduce-trunk-Java8 - Build # 127 - Still Failing
Date Mon, 09 Mar 2015 15:16:23 GMT
See https://builds.apache.org/job/Hadoop-Mapreduce-trunk-Java8/127/

###################################################################################
########################## LAST 60 LINES OF THE CONSOLE ###########################
[...truncated 10602 lines...]

Failed tests: 
  TestCombineFileInputFormat.testSplitPlacementForCompressedFiles:911 expected:<2> but
was:<1>
  TestCombineFileInputFormat.testSplitPlacement:368 expected:<2> but was:<1>

Tests run: 522, Failures: 2, Errors: 0, Skipped: 11

[INFO] ------------------------------------------------------------------------
[INFO] Reactor Summary:
[INFO] 
[INFO] hadoop-mapreduce-client ........................... SUCCESS [  2.073 s]
[INFO] hadoop-mapreduce-client-core ...................... SUCCESS [01:17 min]
[INFO] hadoop-mapreduce-client-common .................... SUCCESS [ 26.104 s]
[INFO] hadoop-mapreduce-client-shuffle ................... SUCCESS [  4.132 s]
[INFO] hadoop-mapreduce-client-app ....................... SUCCESS [11:46 min]
[INFO] hadoop-mapreduce-client-hs ........................ SUCCESS [06:33 min]
[INFO] hadoop-mapreduce-client-jobclient ................. FAILURE [  01:48 h]
[INFO] hadoop-mapreduce-client-hs-plugins ................ SKIPPED
[INFO] hadoop-mapreduce-client-nativetask ................ SKIPPED
[INFO] Apache Hadoop MapReduce Examples .................. SKIPPED
[INFO] hadoop-mapreduce .................................. SKIPPED
[INFO] ------------------------------------------------------------------------
[INFO] BUILD FAILURE
[INFO] ------------------------------------------------------------------------
[INFO] Total time: 02:08 h
[INFO] Finished at: 2015-03-09T15:15:56+00:00
[INFO] Final Memory: 33M/195M
[INFO] ------------------------------------------------------------------------
[ERROR] Failed to execute goal org.apache.maven.plugins:maven-surefire-plugin:2.17:test (default-test)
on project hadoop-mapreduce-client-jobclient: There are test failures.
[ERROR] 
[ERROR] Please refer to /home/jenkins/jenkins-slave/workspace/Hadoop-Mapreduce-trunk-Java8/hadoop-mapreduce-project/hadoop-mapreduce-client/hadoop-mapreduce-client-jobclient/target/surefire-reports
for the individual test results.
[ERROR] -> [Help 1]
[ERROR] 
[ERROR] To see the full stack trace of the errors, re-run Maven with the -e switch.
[ERROR] Re-run Maven using the -X switch to enable full debug logging.
[ERROR] 
[ERROR] For more information about the errors and possible solutions, please read the following
articles:
[ERROR] [Help 1] http://cwiki.apache.org/confluence/display/MAVEN/MojoFailureException
[ERROR] 
[ERROR] After correcting the problems, you can resume the build with the command
[ERROR]   mvn <goals> -rf :hadoop-mapreduce-client-jobclient
Build step 'Execute shell' marked build as failure
[FINDBUGS] Skipping publisher since build result is FAILURE
Archiving artifacts
Sending artifact delta relative to Hadoop-Mapreduce-trunk-Java8 #28
Archived 1 artifacts
Archive block size is 32768
Received 0 blocks and 20320490 bytes
Compression is 0.0%
Took 10 sec
Recording test results
Updating MAPREDUCE-5657
Updating HADOOP-11673
Updating HADOOP-11670
Updating HDFS-7411
Updating YARN-3296
Updating HDFS-7857
Email was triggered for: Failure
Sending email for trigger: Failure



###################################################################################
############################## FAILED TESTS (if any) ##############################
2 tests failed.
FAILED:  org.apache.hadoop.mapreduce.lib.input.TestCombineFileInputFormat.testSplitPlacementForCompressedFiles

Error Message:
expected:<2> but was:<1>

Stack Trace:
junit.framework.AssertionFailedError: expected:<2> but was:<1>
	at junit.framework.Assert.fail(Assert.java:57)
	at junit.framework.Assert.failNotEquals(Assert.java:329)
	at junit.framework.Assert.assertEquals(Assert.java:78)
	at junit.framework.Assert.assertEquals(Assert.java:234)
	at junit.framework.Assert.assertEquals(Assert.java:241)
	at junit.framework.TestCase.assertEquals(TestCase.java:409)
	at org.apache.hadoop.mapreduce.lib.input.TestCombineFileInputFormat.testSplitPlacementForCompressedFiles(TestCombineFileInputFormat.java:911)


FAILED:  org.apache.hadoop.mapreduce.lib.input.TestCombineFileInputFormat.testSplitPlacement

Error Message:
expected:<2> but was:<1>

Stack Trace:
junit.framework.AssertionFailedError: expected:<2> but was:<1>
	at junit.framework.Assert.fail(Assert.java:57)
	at junit.framework.Assert.failNotEquals(Assert.java:329)
	at junit.framework.Assert.assertEquals(Assert.java:78)
	at junit.framework.Assert.assertEquals(Assert.java:234)
	at junit.framework.Assert.assertEquals(Assert.java:241)
	at junit.framework.TestCase.assertEquals(TestCase.java:409)
	at org.apache.hadoop.mapreduce.lib.input.TestCombineFileInputFormat.testSplitPlacement(TestCombineFileInputFormat.java:368)



Mime
  • Unnamed multipart/mixed (inline, None, 0 bytes)
View raw message