hadoop-mapreduce-dev mailing list archives

Site index · List index
Message view « Date » · « Thread »
Top « Date » · « Thread »
From Apache Jenkins Server <jenk...@builds.apache.org>
Subject Hadoop-Mapreduce-trunk - Build # 2089 - Still Failing
Date Sat, 21 Mar 2015 13:44:31 GMT
See https://builds.apache.org/job/Hadoop-Mapreduce-trunk/2089/

###################################################################################
########################## LAST 60 LINES OF THE CONSOLE ###########################
[...truncated 30945 lines...]
[INFO] ------------------------------------------------------------------------
[INFO] Reactor Summary:
[INFO] 
[INFO] hadoop-mapreduce-client ........................... SUCCESS [  2.721 s]
[INFO] hadoop-mapreduce-client-core ...................... SUCCESS [01:43 min]
[INFO] hadoop-mapreduce-client-common .................... SUCCESS [ 27.743 s]
[INFO] hadoop-mapreduce-client-shuffle ................... SUCCESS [  4.762 s]
[INFO] hadoop-mapreduce-client-app ....................... SUCCESS [09:59 min]
[INFO] hadoop-mapreduce-client-hs ........................ FAILURE [05:49 min]
[INFO] hadoop-mapreduce-client-jobclient ................. SKIPPED
[INFO] hadoop-mapreduce-client-hs-plugins ................ SKIPPED
[INFO] hadoop-mapreduce-client-nativetask ................ SKIPPED
[INFO] Apache Hadoop MapReduce Examples .................. SKIPPED
[INFO] hadoop-mapreduce .................................. SKIPPED
[INFO] ------------------------------------------------------------------------
[INFO] BUILD FAILURE
[INFO] ------------------------------------------------------------------------
[INFO] Total time: 18:09 min
[INFO] Finished at: 2015-03-21T13:44:10+00:00
[INFO] Final Memory: 44M/652M
[INFO] ------------------------------------------------------------------------
[ERROR] Failed to execute goal org.apache.maven.plugins:maven-surefire-plugin:2.17:test (default-test)
on project hadoop-mapreduce-client-hs: There are test failures.
[ERROR] 
[ERROR] Please refer to /home/jenkins/jenkins-slave/workspace/Hadoop-Mapreduce-trunk/hadoop-mapreduce-project/hadoop-mapreduce-client/hadoop-mapreduce-client-hs/target/surefire-reports
for the individual test results.
[ERROR] -> [Help 1]
[ERROR] 
[ERROR] To see the full stack trace of the errors, re-run Maven with the -e switch.
[ERROR] Re-run Maven using the -X switch to enable full debug logging.
[ERROR] 
[ERROR] For more information about the errors and possible solutions, please read the following
articles:
[ERROR] [Help 1] http://cwiki.apache.org/confluence/display/MAVEN/MojoFailureException
[ERROR] 
[ERROR] After correcting the problems, you can resume the build with the command
[ERROR]   mvn <goals> -rf :hadoop-mapreduce-client-hs
Build step 'Execute shell' marked build as failure
[FINDBUGS] Skipping publisher since build result is FAILURE
Archiving artifacts
Sending artifact delta relative to Hadoop-Mapreduce-trunk #2084
Archived 1 artifacts
Archive block size is 32768
Received 0 blocks and 20324241 bytes
Compression is 0.0%
Took 9.3 sec
Recording test results
Updating YARN-3369
Updating HADOOP-11447
Updating YARN-3269
Updating MAPREDUCE-6282
Updating HDFS-7957
Updating YARN-3350
Updating HDFS-6841
Updating HDFS-7835
Updating HADOOP-11709
Updating YARN-2777
Updating YARN-3345
Updating HDFS-7829
Updating YARN-3356
Email was triggered for: Failure
Sending email for trigger: Failure



###################################################################################
############################## FAILED TESTS (if any) ##############################
1 tests failed.
REGRESSION:  org.apache.hadoop.mapreduce.v2.hs.TestJobHistoryParsing.testPartialJob

Error Message:
test timed out after 3000 milliseconds

Stack Trace:
java.lang.Exception: test timed out after 3000 milliseconds
	at java.net.PlainDatagramSocketImpl.receive0(Native Method)
	at java.net.AbstractPlainDatagramSocketImpl.receive(AbstractPlainDatagramSocketImpl.java:145)
	at java.net.DatagramSocket.receive(DatagramSocket.java:786)
	at com.sun.jndi.dns.DnsClient.doUdpQuery(DnsClient.java:416)
	at com.sun.jndi.dns.DnsClient.query(DnsClient.java:210)
	at com.sun.jndi.dns.Resolver.query(Resolver.java:81)
	at com.sun.jndi.dns.DnsContext.c_getAttributes(DnsContext.java:430)
	at com.sun.jndi.toolkit.ctx.ComponentDirContext.p_getAttributes(ComponentDirContext.java:231)
	at com.sun.jndi.toolkit.ctx.PartialCompositeDirContext.getAttributes(PartialCompositeDirContext.java:139)
	at com.sun.jndi.toolkit.url.GenericURLDirContext.getAttributes(GenericURLDirContext.java:103)
	at sun.security.krb5.KrbServiceLocator.getKerberosService(KrbServiceLocator.java:87)
	at sun.security.krb5.Config.checkRealm(Config.java:1295)
	at sun.security.krb5.Config.getRealmFromDNS(Config.java:1268)
	at sun.security.krb5.Config.getDefaultRealm(Config.java:1162)
	at sun.reflect.NativeMethodAccessorImpl.invoke0(Native Method)
	at sun.reflect.NativeMethodAccessorImpl.invoke(NativeMethodAccessorImpl.java:57)
	at sun.reflect.DelegatingMethodAccessorImpl.invoke(DelegatingMethodAccessorImpl.java:43)
	at java.lang.reflect.Method.invoke(Method.java:606)
	at org.apache.hadoop.security.authentication.util.KerberosUtil.getDefaultRealm(KerberosUtil.java:84)
	at org.apache.hadoop.security.authentication.util.KerberosName.<clinit>(KerberosName.java:86)
	at org.apache.hadoop.security.UserGroupInformation.initialize(UserGroupInformation.java:274)
	at org.apache.hadoop.security.UserGroupInformation.ensureInitialized(UserGroupInformation.java:261)
	at org.apache.hadoop.security.UserGroupInformation.loginUserFromSubject(UserGroupInformation.java:802)
	at org.apache.hadoop.security.UserGroupInformation.getLoginUser(UserGroupInformation.java:772)
	at org.apache.hadoop.security.UserGroupInformation.getCurrentUser(UserGroupInformation.java:645)
	at org.apache.hadoop.mapreduce.v2.hs.TestJobHistoryParsing.testPartialJob(TestJobHistoryParsing.java:829)



Mime
  • Unnamed multipart/mixed (inline, None, 0 bytes)
View raw message