hadoop-mapreduce-dev mailing list archives

Site index · List index
Message view « Date » · « Thread »
Top « Date » · « Thread »
From Apache Jenkins Server <jenk...@builds.apache.org>
Subject Hadoop-Mapreduce-trunk-Java8 - Build # 136 - Still Failing
Date Wed, 18 Mar 2015 15:31:17 GMT
See https://builds.apache.org/job/Hadoop-Mapreduce-trunk-Java8/136/

###################################################################################
########################## LAST 60 LINES OF THE CONSOLE ###########################
[...truncated 27135 lines...]
  TestMRJobs.testConfVerificationWithOutClassloader:258->testConfVerification:351 » 
  TestMRJobs.testRandomWriter:455 »  test timed out after 60000 milliseconds

Tests run: 508, Failures: 2, Errors: 1, Skipped: 11

[INFO] ------------------------------------------------------------------------
[INFO] Reactor Summary:
[INFO] 
[INFO] hadoop-mapreduce-client ........................... SUCCESS [  2.124 s]
[INFO] hadoop-mapreduce-client-core ...................... SUCCESS [01:25 min]
[INFO] hadoop-mapreduce-client-common .................... SUCCESS [ 25.586 s]
[INFO] hadoop-mapreduce-client-shuffle ................... SUCCESS [  4.101 s]
[INFO] hadoop-mapreduce-client-app ....................... SUCCESS [13:08 min]
[INFO] hadoop-mapreduce-client-hs ........................ SUCCESS [06:10 min]
[INFO] hadoop-mapreduce-client-jobclient ................. FAILURE [  02:01 h]
[INFO] hadoop-mapreduce-client-hs-plugins ................ SKIPPED
[INFO] hadoop-mapreduce-client-nativetask ................ SKIPPED
[INFO] Apache Hadoop MapReduce Examples .................. SKIPPED
[INFO] hadoop-mapreduce .................................. SKIPPED
[INFO] ------------------------------------------------------------------------
[INFO] BUILD FAILURE
[INFO] ------------------------------------------------------------------------
[INFO] Total time: 02:22 h
[INFO] Finished at: 2015-03-18T15:30:51+00:00
[INFO] Final Memory: 33M/227M
[INFO] ------------------------------------------------------------------------
[ERROR] Failed to execute goal org.apache.maven.plugins:maven-surefire-plugin:2.17:test (default-test)
on project hadoop-mapreduce-client-jobclient: There was a timeout or other error in the fork
-> [Help 1]
[ERROR] 
[ERROR] To see the full stack trace of the errors, re-run Maven with the -e switch.
[ERROR] Re-run Maven using the -X switch to enable full debug logging.
[ERROR] 
[ERROR] For more information about the errors and possible solutions, please read the following
articles:
[ERROR] [Help 1] http://cwiki.apache.org/confluence/display/MAVEN/MojoFailureException
[ERROR] 
[ERROR] After correcting the problems, you can resume the build with the command
[ERROR]   mvn <goals> -rf :hadoop-mapreduce-client-jobclient
Build step 'Execute shell' marked build as failure
[FINDBUGS] Skipping publisher since build result is FAILURE
Archiving artifacts
Sending artifact delta relative to Hadoop-Mapreduce-trunk-Java8 #28
Archived 1 artifacts
Archive block size is 32768
Received 0 blocks and 20325336 bytes
Compression is 0.0%
Took 6.4 sec
Recording test results
Updating HDFS-7946
Updating YARN-3181
Updating YARN-3305
Updating YARN-3243
Updating YARN-3273
Updating YARN-3205
Updating HADOOP-11721
Updating HADOOP-11659
Updating HADOOP-11722
Updating HDFS-7940
Updating MAPREDUCE-5807
Email was triggered for: Failure
Sending email for trigger: Failure



###################################################################################
############################## FAILED TESTS (if any) ##############################
3 tests failed.
REGRESSION:  org.apache.hadoop.mapred.TestReduceFetchFromPartialMem.testReduceFromPartialMem

Error Message:
File /tmp/hadoop-yarn/staging/jenkins/.staging/job_1426688826965_0001/job.split could only
be replicated to 0 nodes instead of minReplication (=1).  There are 2 datanode(s) running
and 2 node(s) are excluded in this operation.
 at org.apache.hadoop.hdfs.server.blockmanagement.BlockManager.chooseTarget4NewBlock(BlockManager.java:1553)
 at org.apache.hadoop.hdfs.server.namenode.FSNamesystem.getAdditionalBlock(FSNamesystem.java:2984)
 at org.apache.hadoop.hdfs.server.namenode.NameNodeRpcServer.addBlock(NameNodeRpcServer.java:726)
 at org.apache.hadoop.hdfs.protocolPB.ClientNamenodeProtocolServerSideTranslatorPB.addBlock(ClientNamenodeProtocolServerSideTranslatorPB.java:492)
 at org.apache.hadoop.hdfs.protocol.proto.ClientNamenodeProtocolProtos$ClientNamenodeProtocol$2.callBlockingMethod(ClientNamenodeProtocolProtos.java)
 at org.apache.hadoop.ipc.ProtobufRpcEngine$Server$ProtoBufRpcInvoker.call(ProtobufRpcEngine.java:636)
 at org.apache.hadoop.ipc.RPC$Server.call(RPC.java:973)
 at org.apache.hadoop.ipc.Server$Handler$1.run(Server.java:2140)
 at org.apache.hadoop.ipc.Server$Handler$1.run(Server.java:2136)
 at java.security.AccessController.doPrivileged(Native Method)
 at javax.security.auth.Subject.doAs(Subject.java:422)
 at org.apache.hadoop.security.UserGroupInformation.doAs(UserGroupInformation.java:1669)
 at org.apache.hadoop.ipc.Server$Handler.run(Server.java:2136)


Stack Trace:
org.apache.hadoop.ipc.RemoteException: File /tmp/hadoop-yarn/staging/jenkins/.staging/job_1426688826965_0001/job.split
could only be replicated to 0 nodes instead of minReplication (=1).  There are 2 datanode(s)
running and 2 node(s) are excluded in this operation.
	at org.apache.hadoop.hdfs.server.blockmanagement.BlockManager.chooseTarget4NewBlock(BlockManager.java:1553)
	at org.apache.hadoop.hdfs.server.namenode.FSNamesystem.getAdditionalBlock(FSNamesystem.java:2984)
	at org.apache.hadoop.hdfs.server.namenode.NameNodeRpcServer.addBlock(NameNodeRpcServer.java:726)
	at org.apache.hadoop.hdfs.protocolPB.ClientNamenodeProtocolServerSideTranslatorPB.addBlock(ClientNamenodeProtocolServerSideTranslatorPB.java:492)
	at org.apache.hadoop.hdfs.protocol.proto.ClientNamenodeProtocolProtos$ClientNamenodeProtocol$2.callBlockingMethod(ClientNamenodeProtocolProtos.java)
	at org.apache.hadoop.ipc.ProtobufRpcEngine$Server$ProtoBufRpcInvoker.call(ProtobufRpcEngine.java:636)
	at org.apache.hadoop.ipc.RPC$Server.call(RPC.java:973)
	at org.apache.hadoop.ipc.Server$Handler$1.run(Server.java:2140)
	at org.apache.hadoop.ipc.Server$Handler$1.run(Server.java:2136)
	at java.security.AccessController.doPrivileged(Native Method)
	at javax.security.auth.Subject.doAs(Subject.java:422)
	at org.apache.hadoop.security.UserGroupInformation.doAs(UserGroupInformation.java:1669)
	at org.apache.hadoop.ipc.Server$Handler.run(Server.java:2136)

	at org.apache.hadoop.ipc.Client.call(Client.java:1492)
	at org.apache.hadoop.ipc.Client.call(Client.java:1423)
	at org.apache.hadoop.ipc.ProtobufRpcEngine$Invoker.invoke(ProtobufRpcEngine.java:229)
	at com.sun.proxy.$Proxy17.addBlock(Unknown Source)
	at org.apache.hadoop.hdfs.protocolPB.ClientNamenodeProtocolTranslatorPB.addBlock(ClientNamenodeProtocolTranslatorPB.java:418)
	at sun.reflect.NativeMethodAccessorImpl.invoke0(Native Method)
	at sun.reflect.NativeMethodAccessorImpl.invoke(NativeMethodAccessorImpl.java:62)
	at sun.reflect.DelegatingMethodAccessorImpl.invoke(DelegatingMethodAccessorImpl.java:43)
	at java.lang.reflect.Method.invoke(Method.java:483)
	at org.apache.hadoop.io.retry.RetryInvocationHandler.invokeMethod(RetryInvocationHandler.java:186)
	at org.apache.hadoop.io.retry.RetryInvocationHandler.invoke(RetryInvocationHandler.java:101)
	at com.sun.proxy.$Proxy18.addBlock(Unknown Source)
	at org.apache.hadoop.hdfs.DFSOutputStream$DataStreamer.locateFollowingBlock(DFSOutputStream.java:1426)
	at org.apache.hadoop.hdfs.DFSOutputStream$DataStreamer.nextBlockOutputStream(DFSOutputStream.java:1220)
	at org.apache.hadoop.hdfs.DFSOutputStream$DataStreamer.run(DFSOutputStream.java:452)


FAILED:  org.apache.hadoop.mapreduce.lib.input.TestCombineFileInputFormat.testSplitPlacementForCompressedFiles

Error Message:
expected:<2> but was:<1>

Stack Trace:
junit.framework.AssertionFailedError: expected:<2> but was:<1>
	at junit.framework.Assert.fail(Assert.java:57)
	at junit.framework.Assert.failNotEquals(Assert.java:329)
	at junit.framework.Assert.assertEquals(Assert.java:78)
	at junit.framework.Assert.assertEquals(Assert.java:234)
	at junit.framework.Assert.assertEquals(Assert.java:241)
	at junit.framework.TestCase.assertEquals(TestCase.java:409)
	at org.apache.hadoop.mapreduce.lib.input.TestCombineFileInputFormat.testSplitPlacementForCompressedFiles(TestCombineFileInputFormat.java:911)


FAILED:  org.apache.hadoop.mapreduce.lib.input.TestCombineFileInputFormat.testSplitPlacement

Error Message:
expected:<2> but was:<1>

Stack Trace:
junit.framework.AssertionFailedError: expected:<2> but was:<1>
	at junit.framework.Assert.fail(Assert.java:57)
	at junit.framework.Assert.failNotEquals(Assert.java:329)
	at junit.framework.Assert.assertEquals(Assert.java:78)
	at junit.framework.Assert.assertEquals(Assert.java:234)
	at junit.framework.Assert.assertEquals(Assert.java:241)
	at junit.framework.TestCase.assertEquals(TestCase.java:409)
	at org.apache.hadoop.mapreduce.lib.input.TestCombineFileInputFormat.testSplitPlacement(TestCombineFileInputFormat.java:368)



Mime
  • Unnamed multipart/mixed (inline, None, 0 bytes)
View raw message