hadoop-mapreduce-dev mailing list archives

Site index · List index
Message view « Date » · « Thread »
Top « Date » · « Thread »
From Apache Jenkins Server <jenk...@builds.apache.org>
Subject Hadoop-Mapreduce-trunk - Build # 2108 - Still Failing
Date Thu, 09 Apr 2015 18:32:57 GMT
See https://builds.apache.org/job/Hadoop-Mapreduce-trunk/2108/

###################################################################################
########################## LAST 60 LINES OF THE CONSOLE ###########################
[...truncated 39527 lines...]
[INFO] 
[INFO] hadoop-mapreduce-client ........................... SUCCESS [  2.716 s]
[INFO] hadoop-mapreduce-client-core ...................... SUCCESS [01:20 min]
[INFO] hadoop-mapreduce-client-common .................... SUCCESS [ 27.671 s]
[INFO] hadoop-mapreduce-client-shuffle ................... SUCCESS [  4.743 s]
[INFO] hadoop-mapreduce-client-app ....................... SUCCESS [08:47 min]
[INFO] hadoop-mapreduce-client-hs ........................ SUCCESS [05:20 min]
[INFO] hadoop-mapreduce-client-jobclient ................. FAILURE [  04:50 h]
[INFO] hadoop-mapreduce-client-hs-plugins ................ SKIPPED
[INFO] hadoop-mapreduce-client-nativetask ................ SKIPPED
[INFO] Apache Hadoop MapReduce Examples .................. SKIPPED
[INFO] hadoop-mapreduce .................................. SKIPPED
[INFO] ------------------------------------------------------------------------
[INFO] BUILD FAILURE
[INFO] ------------------------------------------------------------------------
[INFO] Total time: 05:06 h
[INFO] Finished at: 2015-04-09T18:32:35+00:00
[INFO] Final Memory: 45M/719M
[INFO] ------------------------------------------------------------------------
[ERROR] Failed to execute goal org.apache.maven.plugins:maven-surefire-plugin:2.17:test (default-test)
on project hadoop-mapreduce-client-jobclient: There was a timeout or other error in the fork
-> [Help 1]
[ERROR] 
[ERROR] To see the full stack trace of the errors, re-run Maven with the -e switch.
[ERROR] Re-run Maven using the -X switch to enable full debug logging.
[ERROR] 
[ERROR] For more information about the errors and possible solutions, please read the following
articles:
[ERROR] [Help 1] http://cwiki.apache.org/confluence/display/MAVEN/MojoFailureException
[ERROR] 
[ERROR] After correcting the problems, you can resume the build with the command
[ERROR]   mvn <goals> -rf :hadoop-mapreduce-client-jobclient
Build step 'Execute shell' marked build as failure
[FINDBUGS] Skipping publisher since build result is FAILURE
Archiving artifacts
Sending artifact delta relative to Hadoop-Mapreduce-trunk #2093
Archived 1 artifacts
Archive block size is 32768
Received 0 blocks and 20325344 bytes
Compression is 0.0%
Took 5.9 sec
Recording test results
Updating HDFS-8072
Updating HDFS-8096
Updating HDFS-3087
Updating YARN-3465
Updating YARN-3459
Updating HDFS-8079
Updating HDFS-8089
Updating HDFS-7979
Updating HADOOP-11814
Updating HDFS-8076
Updating YARN-2901
Updating HDFS-7725
Updating HDFS-7813
Updating HADOOP-11781
Updating HDFS-7808
Updating HDFS-8025
Updating YARN-2890
Updating HDFS-8046
Email was triggered for: Failure
Sending email for trigger: Failure



###################################################################################
############################## FAILED TESTS (if any) ##############################
9 tests failed.
FAILED:  org.apache.hadoop.mapred.TestLazyOutput.testLazyOutput

Error Message:
null

Stack Trace:
junit.framework.AssertionFailedError: null
	at junit.framework.Assert.fail(Assert.java:55)
	at junit.framework.Assert.assertTrue(Assert.java:22)
	at junit.framework.Assert.assertTrue(Assert.java:31)
	at junit.framework.TestCase.assertTrue(TestCase.java:201)
	at org.apache.hadoop.mapred.TestLazyOutput.testLazyOutput(TestLazyOutput.java:165)


REGRESSION:  org.apache.hadoop.mapreduce.lib.partition.TestMRKeyFieldBasedComparator.testBasicUnixComparator

Error Message:
java.util.zip.ZipException: invalid code lengths set

Stack Trace:
java.lang.RuntimeException: java.util.zip.ZipException: invalid code lengths set
	at java.util.zip.InflaterInputStream.read(InflaterInputStream.java:164)
	at java.util.zip.InflaterInputStream.read(InflaterInputStream.java:122)
	at java.io.FilterInputStream.read(FilterInputStream.java:83)
	at org.apache.xerces.impl.XMLEntityManager$RewindableInputStream.read(Unknown Source)
	at org.apache.xerces.impl.XMLEntityManager.setupCurrentEntity(Unknown Source)
	at org.apache.xerces.impl.XMLVersionDetector.determineDocVersion(Unknown Source)
	at org.apache.xerces.parsers.XML11Configuration.parse(Unknown Source)
	at org.apache.xerces.parsers.XML11Configuration.parse(Unknown Source)
	at org.apache.xerces.parsers.XMLParser.parse(Unknown Source)
	at org.apache.xerces.parsers.DOMParser.parse(Unknown Source)
	at org.apache.xerces.jaxp.DocumentBuilderImpl.parse(Unknown Source)
	at javax.xml.parsers.DocumentBuilder.parse(DocumentBuilder.java:150)
	at org.apache.hadoop.conf.Configuration.parse(Configuration.java:2501)
	at org.apache.hadoop.conf.Configuration.parse(Configuration.java:2489)
	at org.apache.hadoop.conf.Configuration.loadResource(Configuration.java:2560)
	at org.apache.hadoop.conf.Configuration.loadResources(Configuration.java:2513)
	at org.apache.hadoop.conf.Configuration.getProps(Configuration.java:2424)
	at org.apache.hadoop.conf.Configuration.get(Configuration.java:998)
	at org.apache.hadoop.mapred.JobConf.checkAndWarnDeprecation(JobConf.java:2010)
	at org.apache.hadoop.mapred.JobConf.<init>(JobConf.java:484)
	at org.apache.hadoop.mapred.LocalJobRunner$Job.<init>(LocalJobRunner.java:154)
	at org.apache.hadoop.mapred.LocalJobRunner.submitJob(LocalJobRunner.java:759)
	at org.apache.hadoop.mapreduce.JobSubmitter.submitJobInternal(JobSubmitter.java:245)
	at org.apache.hadoop.mapreduce.Job$10.run(Job.java:1290)
	at org.apache.hadoop.mapreduce.Job$10.run(Job.java:1287)
	at java.security.AccessController.doPrivileged(Native Method)
	at javax.security.auth.Subject.doAs(Subject.java:415)
	at org.apache.hadoop.security.UserGroupInformation.doAs(UserGroupInformation.java:1669)
	at org.apache.hadoop.mapreduce.Job.submit(Job.java:1287)
	at org.apache.hadoop.mapreduce.Job.waitForCompletion(Job.java:1308)
	at org.apache.hadoop.mapreduce.lib.partition.TestMRKeyFieldBasedComparator.testComparator(TestMRKeyFieldBasedComparator.java:68)
	at org.apache.hadoop.mapreduce.lib.partition.TestMRKeyFieldBasedComparator.testBasicUnixComparator(TestMRKeyFieldBasedComparator.java:110)


FAILED:  org.apache.hadoop.mapred.TestClusterMRNotification.testMR

Error Message:
Job didn't finish in 30 seconds

Stack Trace:
java.io.IOException: Job didn't finish in 30 seconds
	at org.apache.hadoop.mapred.UtilsForTests.runJobKill(UtilsForTests.java:672)
	at org.apache.hadoop.mapred.NotificationTestCase.testMR(NotificationTestCase.java:178)
	at sun.reflect.NativeMethodAccessorImpl.invoke0(Native Method)
	at sun.reflect.NativeMethodAccessorImpl.invoke(NativeMethodAccessorImpl.java:57)
	at sun.reflect.DelegatingMethodAccessorImpl.invoke(DelegatingMethodAccessorImpl.java:43)
	at java.lang.reflect.Method.invoke(Method.java:606)
	at junit.framework.TestCase.runTest(TestCase.java:176)
	at junit.framework.TestCase.runBare(TestCase.java:141)
	at junit.framework.TestResult$1.protect(TestResult.java:122)
	at junit.framework.TestResult.runProtected(TestResult.java:142)
	at junit.framework.TestResult.run(TestResult.java:125)
	at junit.framework.TestCase.run(TestCase.java:129)
	at junit.framework.TestSuite.runTest(TestSuite.java:255)
	at junit.framework.TestSuite.run(TestSuite.java:250)
	at org.junit.internal.runners.JUnit38ClassRunner.run(JUnit38ClassRunner.java:84)
	at org.apache.maven.surefire.junit4.JUnit4Provider.execute(JUnit4Provider.java:264)
	at org.apache.maven.surefire.junit4.JUnit4Provider.executeTestSet(JUnit4Provider.java:153)
	at org.apache.maven.surefire.junit4.JUnit4Provider.invoke(JUnit4Provider.java:124)
	at org.apache.maven.surefire.booter.ForkedBooter.invokeProviderInSameClassLoader(ForkedBooter.java:200)
	at org.apache.maven.surefire.booter.ForkedBooter.runSuitesInProcess(ForkedBooter.java:153)
	at org.apache.maven.surefire.booter.ForkedBooter.main(ForkedBooter.java:103)


FAILED:  org.apache.hadoop.mapred.TestMRTimelineEventHandling.testMRTimelineEventHandling

Error Message:
Job didn't finish in 30 seconds

Stack Trace:
java.io.IOException: Job didn't finish in 30 seconds
	at org.apache.hadoop.mapred.UtilsForTests.runJobFail(UtilsForTests.java:647)
	at org.apache.hadoop.mapred.TestMRTimelineEventHandling.testMRTimelineEventHandling(TestMRTimelineEventHandling.java:115)


FAILED:  org.apache.hadoop.mapred.TestMRTimelineEventHandling.testMapreduceJobTimelineServiceEnabled

Error Message:
Job didn't finish in 30 seconds

Stack Trace:
java.io.IOException: Job didn't finish in 30 seconds
	at org.apache.hadoop.mapred.UtilsForTests.runJobSucceed(UtilsForTests.java:622)
	at org.apache.hadoop.mapred.TestMRTimelineEventHandling.testMapreduceJobTimelineServiceEnabled(TestMRTimelineEventHandling.java:162)


FAILED:  org.apache.hadoop.mapred.pipes.TestPipeApplication.testSubmitter

Error Message:
null

Stack Trace:
java.lang.AssertionError: null
	at org.junit.Assert.fail(Assert.java:86)
	at org.junit.Assert.assertTrue(Assert.java:41)
	at org.junit.Assert.assertTrue(Assert.java:52)
	at org.apache.hadoop.mapred.pipes.TestPipeApplication.testSubmitter(TestPipeApplication.java:281)


FAILED:  org.apache.hadoop.mapreduce.v2.TestMRJobsWithHistoryService.testJobHistoryData

Error Message:
expected:<FINISHED> but was:<FINISHING>

Stack Trace:
java.lang.AssertionError: expected:<FINISHED> but was:<FINISHING>
	at org.junit.Assert.fail(Assert.java:88)
	at org.junit.Assert.failNotEquals(Assert.java:743)
	at org.junit.Assert.assertEquals(Assert.java:118)
	at org.junit.Assert.assertEquals(Assert.java:144)
	at org.apache.hadoop.mapreduce.v2.TestMRJobsWithHistoryService.testJobHistoryData(TestMRJobsWithHistoryService.java:151)


FAILED:  org.apache.hadoop.mapreduce.v2.TestMRJobsWithProfiler.testDefaultProfiler

Error Message:
expected:<FINISHED> but was:<FINISHING>

Stack Trace:
java.lang.AssertionError: expected:<FINISHED> but was:<FINISHING>
	at org.junit.Assert.fail(Assert.java:88)
	at org.junit.Assert.failNotEquals(Assert.java:743)
	at org.junit.Assert.assertEquals(Assert.java:118)
	at org.junit.Assert.assertEquals(Assert.java:144)
	at org.apache.hadoop.mapreduce.v2.TestMRJobsWithProfiler.testProfilerInternal(TestMRJobsWithProfiler.java:169)
	at org.apache.hadoop.mapreduce.v2.TestMRJobsWithProfiler.testDefaultProfiler(TestMRJobsWithProfiler.java:111)


FAILED:  org.apache.hadoop.mapreduce.v2.TestMRJobsWithProfiler.testDifferentProfilers

Error Message:
test timed out after 150000 milliseconds

Stack Trace:
java.lang.Exception: test timed out after 150000 milliseconds
	at java.lang.Thread.sleep(Native Method)
	at org.apache.hadoop.mapreduce.Job.monitorAndPrintJob(Job.java:1353)
	at org.apache.hadoop.mapreduce.Job.waitForCompletion(Job.java:1311)
	at org.apache.hadoop.mapreduce.v2.TestMRJobsWithProfiler.testProfilerInternal(TestMRJobsWithProfiler.java:150)
	at org.apache.hadoop.mapreduce.v2.TestMRJobsWithProfiler.testDifferentProfilers(TestMRJobsWithProfiler.java:117)



Mime
  • Unnamed multipart/mixed (inline, None, 0 bytes)
View raw message