hadoop-mapreduce-dev mailing list archives

Site index · List index
Message view « Date » · « Thread »
Top « Date » · « Thread »
From Apache Jenkins Server <jenk...@builds.apache.org>
Subject Hadoop-Mapreduce-trunk-Java8 - Build # 162 - Still Failing
Date Sun, 12 Apr 2015 15:05:16 GMT
See https://builds.apache.org/job/Hadoop-Mapreduce-trunk-Java8/162/

###################################################################################
########################## LAST 60 LINES OF THE CONSOLE ###########################
[...truncated 10864 lines...]
Java HotSpot(TM) 64-Bit Server VM warning: ignoring option MaxPermSize=768m; support was removed
in 8.0
Running org.apache.hadoop.io.TestSequenceFileMergeProgress
Tests run: 3, Failures: 0, Errors: 0, Skipped: 0, Time elapsed: 1.266 sec - in org.apache.hadoop.io.TestSequenceFileMergeProgress

Results :

Failed tests: 
  TestCombineFileInputFormat.testSplitPlacementForCompressedFiles:918 expected:<2> but
was:<1>
  TestCombineFileInputFormat.testSplitPlacement:372 expected:<2> but was:<1>

Tests run: 519, Failures: 2, Errors: 0, Skipped: 11

[INFO] ------------------------------------------------------------------------
[INFO] Reactor Summary:
[INFO] 
[INFO] hadoop-mapreduce-client ........................... SUCCESS [  2.150 s]
[INFO] hadoop-mapreduce-client-core ...................... SUCCESS [01:07 min]
[INFO] hadoop-mapreduce-client-common .................... SUCCESS [ 25.082 s]
[INFO] hadoop-mapreduce-client-shuffle ................... SUCCESS [  4.028 s]
[INFO] hadoop-mapreduce-client-app ....................... SUCCESS [10:10 min]
[INFO] hadoop-mapreduce-client-hs ........................ SUCCESS [05:54 min]
[INFO] hadoop-mapreduce-client-jobclient ................. FAILURE [  01:40 h]
[INFO] hadoop-mapreduce-client-hs-plugins ................ SKIPPED
[INFO] hadoop-mapreduce-client-nativetask ................ SKIPPED
[INFO] Apache Hadoop MapReduce Examples .................. SKIPPED
[INFO] hadoop-mapreduce .................................. SKIPPED
[INFO] ------------------------------------------------------------------------
[INFO] BUILD FAILURE
[INFO] ------------------------------------------------------------------------
[INFO] Total time: 01:57 h
[INFO] Finished at: 2015-04-12T15:05:00+00:00
[INFO] Final Memory: 34M/197M
[INFO] ------------------------------------------------------------------------
[ERROR] Failed to execute goal org.apache.maven.plugins:maven-surefire-plugin:2.17:test (default-test)
on project hadoop-mapreduce-client-jobclient: There are test failures.
[ERROR] 
[ERROR] Please refer to /home/jenkins/jenkins-slave/workspace/Hadoop-Mapreduce-trunk-Java8/hadoop-mapreduce-project/hadoop-mapreduce-client/hadoop-mapreduce-client-jobclient/target/surefire-reports
for the individual test results.
[ERROR] -> [Help 1]
[ERROR] 
[ERROR] To see the full stack trace of the errors, re-run Maven with the -e switch.
[ERROR] Re-run Maven using the -X switch to enable full debug logging.
[ERROR] 
[ERROR] For more information about the errors and possible solutions, please read the following
articles:
[ERROR] [Help 1] http://cwiki.apache.org/confluence/display/MAVEN/MojoFailureException
[ERROR] 
[ERROR] After correcting the problems, you can resume the build with the command
[ERROR]   mvn <goals> -rf :hadoop-mapreduce-client-jobclient
Build step 'Execute shell' marked build as failure
[FINDBUGS] Skipping publisher since build result is FAILURE
Archiving artifacts
Sending artifact delta relative to Hadoop-Mapreduce-trunk-Java8 #28
Archived 1 artifacts
Archive block size is 32768
Received 0 blocks and 20334947 bytes
Compression is 0.0%
Took 9.6 sec
Recording test results
Updating HDFS-7933
Email was triggered for: Failure
Sending email for trigger: Failure



###################################################################################
############################## FAILED TESTS (if any) ##############################
2 tests failed.
FAILED:  org.apache.hadoop.mapreduce.lib.input.TestCombineFileInputFormat.testSplitPlacementForCompressedFiles

Error Message:
expected:<2> but was:<1>

Stack Trace:
java.lang.AssertionError: expected:<2> but was:<1>
	at org.junit.Assert.fail(Assert.java:88)
	at org.junit.Assert.failNotEquals(Assert.java:743)
	at org.junit.Assert.assertEquals(Assert.java:118)
	at org.junit.Assert.assertEquals(Assert.java:555)
	at org.junit.Assert.assertEquals(Assert.java:542)
	at org.apache.hadoop.mapreduce.lib.input.TestCombineFileInputFormat.testSplitPlacementForCompressedFiles(TestCombineFileInputFormat.java:918)


FAILED:  org.apache.hadoop.mapreduce.lib.input.TestCombineFileInputFormat.testSplitPlacement

Error Message:
expected:<2> but was:<1>

Stack Trace:
java.lang.AssertionError: expected:<2> but was:<1>
	at org.junit.Assert.fail(Assert.java:88)
	at org.junit.Assert.failNotEquals(Assert.java:743)
	at org.junit.Assert.assertEquals(Assert.java:118)
	at org.junit.Assert.assertEquals(Assert.java:555)
	at org.junit.Assert.assertEquals(Assert.java:542)
	at org.apache.hadoop.mapreduce.lib.input.TestCombineFileInputFormat.testSplitPlacement(TestCombineFileInputFormat.java:372)



Mime
  • Unnamed multipart/mixed (inline, None, 0 bytes)
View raw message