hadoop-mapreduce-dev mailing list archives

Site index · List index
Message view « Date » · « Thread »
Top « Date » · « Thread »
From Apache Jenkins Server <jenk...@builds.apache.org>
Subject Hadoop-Mapreduce-trunk - Build # 2133 - Failure
Date Mon, 04 May 2015 15:29:09 GMT
See https://builds.apache.org/job/Hadoop-Mapreduce-trunk/2133/

###################################################################################
########################## LAST 60 LINES OF THE CONSOLE ###########################
[...truncated 31969 lines...]
Tests run: 3, Failures: 0, Errors: 0, Skipped: 0, Time elapsed: 1.839 sec - in org.apache.hadoop.mapred.TestSequenceFileAsBinaryOutputFormat

Results :

Tests in error: 
  TestMRTimelineEventHandling.testMapreduceJobTimelineServiceEnabled:153 ยป IO Jo...

Tests run: 520, Failures: 0, Errors: 1, Skipped: 11

[INFO] ------------------------------------------------------------------------
[INFO] Reactor Summary:
[INFO] 
[INFO] hadoop-mapreduce-client ........................... SUCCESS [  2.718 s]
[INFO] hadoop-mapreduce-client-core ...................... SUCCESS [01:21 min]
[INFO] hadoop-mapreduce-client-common .................... SUCCESS [ 27.590 s]
[INFO] hadoop-mapreduce-client-shuffle ................... SUCCESS [  4.739 s]
[INFO] hadoop-mapreduce-client-app ....................... SUCCESS [08:28 min]
[INFO] hadoop-mapreduce-client-hs ........................ SUCCESS [05:26 min]
[INFO] hadoop-mapreduce-client-jobclient ................. FAILURE [  01:46 h]
[INFO] hadoop-mapreduce-client-hs-plugins ................ SKIPPED
[INFO] hadoop-mapreduce-client-nativetask ................ SKIPPED
[INFO] Apache Hadoop MapReduce Examples .................. SKIPPED
[INFO] hadoop-mapreduce .................................. SKIPPED
[INFO] ------------------------------------------------------------------------
[INFO] BUILD FAILURE
[INFO] ------------------------------------------------------------------------
[INFO] Total time: 02:02 h
[INFO] Finished at: 2015-05-04T15:28:54+00:00
[INFO] Final Memory: 40M/1017M
[INFO] ------------------------------------------------------------------------
[ERROR] Failed to execute goal org.apache.maven.plugins:maven-surefire-plugin:2.17:test (default-test)
on project hadoop-mapreduce-client-jobclient: There are test failures.
[ERROR] 
[ERROR] Please refer to /home/jenkins/jenkins-slave/workspace/Hadoop-Mapreduce-trunk/hadoop-mapreduce-project/hadoop-mapreduce-client/hadoop-mapreduce-client-jobclient/target/surefire-reports
for the individual test results.
[ERROR] -> [Help 1]
[ERROR] 
[ERROR] To see the full stack trace of the errors, re-run Maven with the -e switch.
[ERROR] Re-run Maven using the -X switch to enable full debug logging.
[ERROR] 
[ERROR] For more information about the errors and possible solutions, please read the following
articles:
[ERROR] [Help 1] http://cwiki.apache.org/confluence/display/MAVEN/MojoFailureException
[ERROR] 
[ERROR] After correcting the problems, you can resume the build with the command
[ERROR]   mvn <goals> -rf :hadoop-mapreduce-client-jobclient
Build step 'Execute shell' marked build as failure
[FINDBUGS] Skipping publisher since build result is FAILURE
Archiving artifacts
Sending artifact delta relative to Hadoop-Mapreduce-trunk #2132
Archived 1 artifacts
Archive block size is 32768
Received 0 blocks and 20334854 bytes
Compression is 0.0%
Took 5.4 sec
Recording test results
Updating MAPREDUCE-6349
Updating HADOOP-11328
Updating MAPREDUCE-5905
Updating HADOOP-9658
Email was triggered for: Failure
Sending email for trigger: Failure



###################################################################################
############################## FAILED TESTS (if any) ##############################
1 tests failed.
REGRESSION:  org.apache.hadoop.mapred.TestMRTimelineEventHandling.testMapreduceJobTimelineServiceEnabled

Error Message:
Job didn't finish in 30 seconds

Stack Trace:
java.io.IOException: Job didn't finish in 30 seconds
	at org.apache.hadoop.mapred.UtilsForTests.runJobSucceed(UtilsForTests.java:622)
	at org.apache.hadoop.mapred.TestMRTimelineEventHandling.testMapreduceJobTimelineServiceEnabled(TestMRTimelineEventHandling.java:153)



Mime
  • Unnamed multipart/mixed (inline, None, 0 bytes)
View raw message