hadoop-mapreduce-dev mailing list archives

Site index · List index
Message view « Date » · « Thread »
Top « Date » · « Thread »
From Apache Jenkins Server <jenk...@builds.apache.org>
Subject Hadoop-Mapreduce-trunk - Build # 2135 - Still Failing
Date Wed, 06 May 2015 16:48:31 GMT
See https://builds.apache.org/job/Hadoop-Mapreduce-trunk/2135/

###################################################################################
########################## LAST 60 LINES OF THE CONSOLE ###########################
[...truncated 31942 lines...]
[INFO] hadoop-mapreduce-client ........................... SUCCESS [  2.862 s]
[INFO] hadoop-mapreduce-client-core ...................... SUCCESS [02:20 min]
[INFO] hadoop-mapreduce-client-common .................... SUCCESS [ 31.928 s]
[INFO] hadoop-mapreduce-client-shuffle ................... SUCCESS [  4.807 s]
[INFO] hadoop-mapreduce-client-app ....................... SUCCESS [14:28 min]
[INFO] hadoop-mapreduce-client-hs ........................ SUCCESS [06:22 min]
[INFO] hadoop-mapreduce-client-jobclient ................. FAILURE [  01:32 h]
[INFO] hadoop-mapreduce-client-hs-plugins ................ SKIPPED
[INFO] hadoop-mapreduce-client-nativetask ................ SKIPPED
[INFO] Apache Hadoop MapReduce Examples .................. SKIPPED
[INFO] hadoop-mapreduce .................................. SKIPPED
[INFO] ------------------------------------------------------------------------
[INFO] BUILD FAILURE
[INFO] ------------------------------------------------------------------------
[INFO] Total time: 01:56 h
[INFO] Finished at: 2015-05-06T16:48:07+00:00
[INFO] Final Memory: 48M/732M
[INFO] ------------------------------------------------------------------------
[ERROR] Failed to execute goal org.apache.maven.plugins:maven-surefire-plugin:2.17:test (default-test)
on project hadoop-mapreduce-client-jobclient: ExecutionException: java.lang.RuntimeException:
The forked VM terminated without properly saying goodbye. VM crash or System.exit called?
[ERROR] Command was /bin/sh -c cd /home/jenkins/jenkins-slave/workspace/Hadoop-Mapreduce-trunk/hadoop-mapreduce-project/hadoop-mapreduce-client/hadoop-mapreduce-client-jobclient
&& /home/jenkins/tools/java/jdk1.7.0_55/jre/bin/java -Xmx4096m -XX:MaxPermSize=768m
-XX:+HeapDumpOnOutOfMemoryError -jar /home/jenkins/jenkins-slave/workspace/Hadoop-Mapreduce-trunk/hadoop-mapreduce-project/hadoop-mapreduce-client/hadoop-mapreduce-client-jobclient/target/surefire/surefirebooter5763079251001828899.jar
/home/jenkins/jenkins-slave/workspace/Hadoop-Mapreduce-trunk/hadoop-mapreduce-project/hadoop-mapreduce-client/hadoop-mapreduce-client-jobclient/target/surefire/surefire987968447402731864tmp
/home/jenkins/jenkins-slave/workspace/Hadoop-Mapreduce-trunk/hadoop-mapreduce-project/hadoop-mapreduce-client/hadoop-mapreduce-client-jobclient/target/surefire/surefire_1812747600976432357327tmp
[ERROR] -> [Help 1]
[ERROR] 
[ERROR] To see the full stack trace of the errors, re-run Maven with the -e switch.
[ERROR] Re-run Maven using the -X switch to enable full debug logging.
[ERROR] 
[ERROR] For more information about the errors and possible solutions, please read the following
articles:
[ERROR] [Help 1] http://cwiki.apache.org/confluence/display/MAVEN/MojoFailureException
[ERROR] 
[ERROR] After correcting the problems, you can resume the build with the command
[ERROR]   mvn <goals> -rf :hadoop-mapreduce-client-jobclient
Build step 'Execute shell' marked build as failure
[FINDBUGS] Skipping publisher since build result is FAILURE
Archiving artifacts
Sending artifact delta relative to Hadoop-Mapreduce-trunk #2132
Archived 1 artifacts
Archive block size is 32768
Received 0 blocks and 20341577 bytes
Compression is 0.0%
Took 7.3 sec
Recording test results
Updating YARN-3582
Updating YARN-3552
Updating HADOOP-11120
Updating HADOOP-11904
Updating HADOOP-11912
Updating HDFS-8314
Updating HADOOP-11911
Updating HADOOP-11926
Updating HADOOP-11917
Updating YARN-3396
Updating MAPREDUCE-6192
Updating HDFS-8305
Updating HDFS-7758
Updating HDFS-7847
Updating HDFS-8219
Updating YARN-2123
Updating YARN-3343
Email was triggered for: Failure
Sending email for trigger: Failure



###################################################################################
############################## FAILED TESTS (if any) ##############################
All tests passed
Mime
  • Unnamed multipart/mixed (inline, None, 0 bytes)
View raw message