hadoop-mapreduce-dev mailing list archives

Site index · List index
Message view « Date » · « Thread »
Top « Date » · « Thread »
From Apache Jenkins Server <jenk...@builds.apache.org>
Subject Hadoop-Mapreduce-trunk - Build # 2137 - Failure
Date Fri, 08 May 2015 17:03:16 GMT
See https://builds.apache.org/job/Hadoop-Mapreduce-trunk/2137/

###################################################################################
########################## LAST 60 LINES OF THE CONSOLE ###########################
[...truncated 32389 lines...]
[ERROR] To see the full stack trace of the errors, re-run Maven with the -e switch.
[ERROR] Re-run Maven using the -X switch to enable full debug logging.
[ERROR] 
[ERROR] For more information about the errors and possible solutions, please read the following
articles:
[ERROR] [Help 1] http://cwiki.apache.org/confluence/display/MAVEN/MojoFailureException
[ERROR] 
[ERROR] After correcting the problems, you can resume the build with the command
[ERROR]   mvn <goals> -rf :hadoop-mapreduce-client-jobclient
Build step 'Execute shell' marked build as failure
[FINDBUGS] Skipping publisher since build result is FAILURE
Archiving artifacts
Sending artifact delta relative to Hadoop-Mapreduce-trunk #2136
Archived 1 artifacts
Archive block size is 32768
Received 0 blocks and 20354927 bytes
Compression is 0.0%
Took 10 sec
Recording test results
Updating HDFS-8222
Updating YARN-3592
Updating HDFS-8037
Updating HADOOP-11936
Updating MAPREDUCE-6279
Updating YARN-3554
Updating YARN-3572
Updating HDFS-6576
Updating HDFS-8174
Updating HADOOP-11877
Updating HDFS-8175
Updating HDFS-8257
Updating HDFS-8321
Updating MAPREDUCE-6342
Updating YARN-2918
Updating YARN-1832
Updating YARN-2784
Updating HDFS-6285
Updating HDFS-3384
Updating HDFS-7998
Updating YARN-3584
Updating HDFS-8108
Updating HDFS-7894
Updating YARN-3448
Updating HADOOP-11922
Updating HDFS-8332
Updating YARN-3589
Updating HDFS-8067
Updating MAPREDUCE-6284
Updating HDFS-8187
Updating HDFS-8349
Updating HDFS-8207
Updating YARN-3358
Updating HDFS-8209
Updating HDFS-8226
Updating HDFS-7980
Updating MAPREDUCE-6079
Updating YARN-3169
Updating HDFS-6291
Email was triggered for: Failure
Sending email for trigger: Failure



###################################################################################
############################## FAILED TESTS (if any) ##############################
14 tests failed.
REGRESSION:  org.apache.hadoop.mapred.TestJobCounters.testHeapUsageCounter

Error Message:
Job job_1431099191997_0001 failed!

Stack Trace:
java.lang.AssertionError: Job job_1431099191997_0001 failed!
	at org.junit.Assert.fail(Assert.java:88)
	at org.junit.Assert.assertTrue(Assert.java:41)
	at org.apache.hadoop.mapred.TestJobCounters.runHeapUsageTestJob(TestJobCounters.java:632)
	at org.apache.hadoop.mapred.TestJobCounters.testHeapUsageCounter(TestJobCounters.java:678)


REGRESSION:  org.apache.hadoop.mapreduce.v2.TestMRAppWithCombiner.testCombinerShouldUpdateTheReporter

Error Message:
org/apache/hadoop/yarn/exceptions/ApplicationIdNotProvidedException

Stack Trace:
java.lang.NoClassDefFoundError: org/apache/hadoop/yarn/exceptions/ApplicationIdNotProvidedException
	at java.net.URLClassLoader$1.run(URLClassLoader.java:366)
	at java.net.URLClassLoader$1.run(URLClassLoader.java:355)
	at java.security.AccessController.doPrivileged(Native Method)
	at java.net.URLClassLoader.findClass(URLClassLoader.java:354)
	at java.lang.ClassLoader.loadClass(ClassLoader.java:425)
	at sun.misc.Launcher$AppClassLoader.loadClass(Launcher.java:308)
	at java.lang.ClassLoader.loadClass(ClassLoader.java:358)
	at org.apache.hadoop.yarn.client.api.YarnClient.createYarnClient(YarnClient.java:76)
	at org.apache.hadoop.mapred.ResourceMgrDelegate.<init>(ResourceMgrDelegate.java:96)
	at org.apache.hadoop.mapred.YARNRunner.<init>(YARNRunner.java:112)
	at org.apache.hadoop.mapred.YarnClientProtocolProvider.create(YarnClientProtocolProvider.java:34)
	at org.apache.hadoop.mapreduce.Cluster.initialize(Cluster.java:95)
	at org.apache.hadoop.mapreduce.Cluster.<init>(Cluster.java:82)
	at org.apache.hadoop.mapreduce.Cluster.<init>(Cluster.java:75)
	at org.apache.hadoop.mapred.JobClient.init(JobClient.java:470)
	at org.apache.hadoop.mapred.JobClient.<init>(JobClient.java:449)
	at org.apache.hadoop.mapreduce.v2.TestMRAppWithCombiner.runJob(TestMRAppWithCombiner.java:146)
	at org.apache.hadoop.mapreduce.v2.TestMRAppWithCombiner.testCombinerShouldUpdateTheReporter(TestMRAppWithCombiner.java:124)


REGRESSION:  org.apache.hadoop.mapreduce.v2.TestUberAM.testSleepJob

Error Message:
org/apache/hadoop/io/NullWritable

Stack Trace:
java.lang.NoClassDefFoundError: org/apache/hadoop/io/NullWritable
	at java.net.URLClassLoader$1.run(URLClassLoader.java:366)
	at java.net.URLClassLoader$1.run(URLClassLoader.java:355)
	at java.security.AccessController.doPrivileged(Native Method)
	at java.net.URLClassLoader.findClass(URLClassLoader.java:354)
	at java.lang.ClassLoader.loadClass(ClassLoader.java:425)
	at sun.misc.Launcher$AppClassLoader.loadClass(Launcher.java:308)
	at java.lang.ClassLoader.loadClass(ClassLoader.java:358)
	at org.apache.hadoop.mapreduce.SleepJob.createJob(SleepJob.java:213)
	at org.apache.hadoop.mapreduce.v2.TestMRJobs.testSleepJobInternal(TestMRJobs.java:216)
	at org.apache.hadoop.mapreduce.v2.TestMRJobs.testSleepJob(TestMRJobs.java:191)
	at org.apache.hadoop.mapreduce.v2.TestUberAM.testSleepJob(TestUberAM.java:57)


REGRESSION:  org.apache.hadoop.mapreduce.v2.TestUberAM.testSleepJobWithMultipleReducers

Error Message:
org/apache/hadoop/io/NullWritable

Stack Trace:
java.lang.NoClassDefFoundError: org/apache/hadoop/io/NullWritable
	at org.apache.hadoop.mapreduce.SleepJob.createJob(SleepJob.java:213)
	at org.apache.hadoop.mapreduce.v2.TestMRJobs.testSleepJobInternal(TestMRJobs.java:216)
	at org.apache.hadoop.mapreduce.v2.TestMRJobs.testSleepJob(TestMRJobs.java:191)
	at org.apache.hadoop.mapreduce.v2.TestUberAM.testSleepJobWithMultipleReducers(TestUberAM.java:64)


REGRESSION:  org.apache.hadoop.mapreduce.v2.TestUberAM.testRandomWriter

Error Message:
org/apache/hadoop/ipc/ProtobufHelper

Stack Trace:
java.lang.NoClassDefFoundError: org/apache/hadoop/ipc/ProtobufHelper
	at org.apache.hadoop.hdfs.protocolPB.ClientNamenodeProtocolTranslatorPB.delete(ClientNamenodeProtocolTranslatorPB.java:542)
	at sun.reflect.NativeMethodAccessorImpl.invoke0(Native Method)
	at sun.reflect.NativeMethodAccessorImpl.invoke(NativeMethodAccessorImpl.java:57)
	at sun.reflect.DelegatingMethodAccessorImpl.invoke(DelegatingMethodAccessorImpl.java:43)
	at java.lang.reflect.Method.invoke(Method.java:606)
	at org.apache.hadoop.io.retry.RetryInvocationHandler.invokeMethod(RetryInvocationHandler.java:186)
	at org.apache.hadoop.io.retry.RetryInvocationHandler.invoke(RetryInvocationHandler.java:101)
	at com.sun.proxy.$Proxy23.delete(Unknown Source)
	at org.apache.hadoop.hdfs.DFSClient.delete(DFSClient.java:1710)
	at org.apache.hadoop.hdfs.DistributedFileSystem$14.doCall(DistributedFileSystem.java:709)
	at org.apache.hadoop.hdfs.DistributedFileSystem$14.doCall(DistributedFileSystem.java:705)
	at org.apache.hadoop.fs.FileSystemLinkResolver.resolve(FileSystemLinkResolver.java:81)
	at org.apache.hadoop.hdfs.DistributedFileSystem.delete(DistributedFileSystem.java:705)
	at org.apache.hadoop.mapreduce.JobSubmitter.submitJobInternal(JobSubmitter.java:256)
	at org.apache.hadoop.mapreduce.Job$10.run(Job.java:1290)
	at org.apache.hadoop.mapreduce.Job$10.run(Job.java:1287)
	at java.security.AccessController.doPrivileged(Native Method)
	at javax.security.auth.Subject.doAs(Subject.java:415)
	at org.apache.hadoop.security.UserGroupInformation.doAs(UserGroupInformation.java:1669)
	at org.apache.hadoop.mapreduce.Job.submit(Job.java:1287)
	at org.apache.hadoop.mapreduce.v2.TestMRJobs.testRandomWriter(TestMRJobs.java:452)
	at org.apache.hadoop.mapreduce.v2.TestUberAM.testRandomWriter(TestUberAM.java:84)


REGRESSION:  org.apache.hadoop.mapreduce.v2.TestUberAM.testDistributedCache

Error Message:
org/apache/hadoop/ipc/ProtobufHelper

Stack Trace:
java.lang.NoClassDefFoundError: org/apache/hadoop/ipc/ProtobufHelper
	at org.apache.hadoop.hdfs.protocolPB.ClientNamenodeProtocolTranslatorPB.delete(ClientNamenodeProtocolTranslatorPB.java:542)
	at sun.reflect.NativeMethodAccessorImpl.invoke0(Native Method)
	at sun.reflect.NativeMethodAccessorImpl.invoke(NativeMethodAccessorImpl.java:57)
	at sun.reflect.DelegatingMethodAccessorImpl.invoke(DelegatingMethodAccessorImpl.java:43)
	at java.lang.reflect.Method.invoke(Method.java:606)
	at org.apache.hadoop.io.retry.RetryInvocationHandler.invokeMethod(RetryInvocationHandler.java:186)
	at org.apache.hadoop.io.retry.RetryInvocationHandler.invoke(RetryInvocationHandler.java:101)
	at com.sun.proxy.$Proxy23.delete(Unknown Source)
	at org.apache.hadoop.hdfs.DFSClient.delete(DFSClient.java:1710)
	at org.apache.hadoop.hdfs.DistributedFileSystem$14.doCall(DistributedFileSystem.java:709)
	at org.apache.hadoop.hdfs.DistributedFileSystem$14.doCall(DistributedFileSystem.java:705)
	at org.apache.hadoop.fs.FileSystemLinkResolver.resolve(FileSystemLinkResolver.java:81)
	at org.apache.hadoop.hdfs.DistributedFileSystem.delete(DistributedFileSystem.java:705)
	at org.apache.hadoop.mapreduce.JobSubmitter.submitJobInternal(JobSubmitter.java:256)
	at org.apache.hadoop.mapreduce.Job$10.run(Job.java:1290)
	at org.apache.hadoop.mapreduce.Job$10.run(Job.java:1287)
	at java.security.AccessController.doPrivileged(Native Method)
	at javax.security.auth.Subject.doAs(Subject.java:415)
	at org.apache.hadoop.security.UserGroupInformation.doAs(UserGroupInformation.java:1669)
	at org.apache.hadoop.mapreduce.Job.submit(Job.java:1287)
	at org.apache.hadoop.mapreduce.v2.TestMRJobs._testDistributedCache(TestMRJobs.java:903)
	at org.apache.hadoop.mapreduce.v2.TestMRJobs.testDistributedCache(TestMRJobs.java:916)
	at sun.reflect.NativeMethodAccessorImpl.invoke0(Native Method)
	at sun.reflect.NativeMethodAccessorImpl.invoke(NativeMethodAccessorImpl.java:57)
	at sun.reflect.DelegatingMethodAccessorImpl.invoke(DelegatingMethodAccessorImpl.java:43)
	at java.lang.reflect.Method.invoke(Method.java:606)
	at org.junit.runners.model.FrameworkMethod$1.runReflectiveCall(FrameworkMethod.java:47)
	at org.junit.internal.runners.model.ReflectiveCallable.run(ReflectiveCallable.java:12)
	at org.junit.runners.model.FrameworkMethod.invokeExplosively(FrameworkMethod.java:44)
	at org.junit.internal.runners.statements.InvokeMethod.evaluate(InvokeMethod.java:17)
	at org.junit.internal.runners.statements.FailOnTimeout$StatementThread.run(FailOnTimeout.java:74)


REGRESSION:  org.apache.hadoop.mapreduce.v2.TestUberAM.testSleepJobWithRemoteJar

Error Message:
org/apache/hadoop/io/NullWritable

Stack Trace:
java.lang.NoClassDefFoundError: org/apache/hadoop/io/NullWritable
	at org.apache.hadoop.mapreduce.SleepJob.createJob(SleepJob.java:213)
	at org.apache.hadoop.mapreduce.v2.TestMRJobs.testSleepJobInternal(TestMRJobs.java:216)
	at org.apache.hadoop.mapreduce.v2.TestMRJobs.testSleepJobWithRemoteJar(TestMRJobs.java:196)
	at sun.reflect.NativeMethodAccessorImpl.invoke0(Native Method)
	at sun.reflect.NativeMethodAccessorImpl.invoke(NativeMethodAccessorImpl.java:57)
	at sun.reflect.DelegatingMethodAccessorImpl.invoke(DelegatingMethodAccessorImpl.java:43)
	at java.lang.reflect.Method.invoke(Method.java:606)
	at org.junit.runners.model.FrameworkMethod$1.runReflectiveCall(FrameworkMethod.java:47)
	at org.junit.internal.runners.model.ReflectiveCallable.run(ReflectiveCallable.java:12)
	at org.junit.runners.model.FrameworkMethod.invokeExplosively(FrameworkMethod.java:44)
	at org.junit.internal.runners.statements.InvokeMethod.evaluate(InvokeMethod.java:17)
	at org.junit.internal.runners.statements.FailOnTimeout$StatementThread.run(FailOnTimeout.java:74)


REGRESSION:  org.apache.hadoop.mapreduce.v2.TestUberAM.testConfVerificationWithJobClient

Error Message:
org/apache/hadoop/io/NullWritable

Stack Trace:
java.lang.NoClassDefFoundError: org/apache/hadoop/io/NullWritable
	at org.apache.hadoop.mapreduce.SleepJob.createJob(SleepJob.java:213)
	at org.apache.hadoop.mapreduce.v2.TestMRJobs.testConfVerification(TestMRJobs.java:318)
	at org.apache.hadoop.mapreduce.v2.TestMRJobs.testConfVerificationWithJobClient(TestMRJobs.java:263)
	at sun.reflect.NativeMethodAccessorImpl.invoke0(Native Method)
	at sun.reflect.NativeMethodAccessorImpl.invoke(NativeMethodAccessorImpl.java:57)
	at sun.reflect.DelegatingMethodAccessorImpl.invoke(DelegatingMethodAccessorImpl.java:43)
	at java.lang.reflect.Method.invoke(Method.java:606)
	at org.junit.runners.model.FrameworkMethod$1.runReflectiveCall(FrameworkMethod.java:47)
	at org.junit.internal.runners.model.ReflectiveCallable.run(ReflectiveCallable.java:12)
	at org.junit.runners.model.FrameworkMethod.invokeExplosively(FrameworkMethod.java:44)
	at org.junit.internal.runners.statements.InvokeMethod.evaluate(InvokeMethod.java:17)
	at org.junit.internal.runners.statements.FailOnTimeout$StatementThread.run(FailOnTimeout.java:74)


REGRESSION:  org.apache.hadoop.mapreduce.v2.TestUberAM.testConfVerificationWithClassloaderCustomClasses

Error Message:
org/apache/hadoop/util/ApplicationClassLoader$1

Stack Trace:
java.lang.NoClassDefFoundError: org/apache/hadoop/util/ApplicationClassLoader$1
	at org.apache.hadoop.util.ApplicationClassLoader.<clinit>(ApplicationClassLoader.java:61)
	at org.apache.hadoop.mapreduce.v2.TestMRJobs.testConfVerification(TestMRJobs.java:302)
	at org.apache.hadoop.mapreduce.v2.TestMRJobs.testConfVerificationWithClassloaderCustomClasses(TestMRJobs.java:253)
	at sun.reflect.NativeMethodAccessorImpl.invoke0(Native Method)
	at sun.reflect.NativeMethodAccessorImpl.invoke(NativeMethodAccessorImpl.java:57)
	at sun.reflect.DelegatingMethodAccessorImpl.invoke(DelegatingMethodAccessorImpl.java:43)
	at java.lang.reflect.Method.invoke(Method.java:606)
	at org.junit.runners.model.FrameworkMethod$1.runReflectiveCall(FrameworkMethod.java:47)
	at org.junit.internal.runners.model.ReflectiveCallable.run(ReflectiveCallable.java:12)
	at org.junit.runners.model.FrameworkMethod.invokeExplosively(FrameworkMethod.java:44)
	at org.junit.internal.runners.statements.InvokeMethod.evaluate(InvokeMethod.java:17)
	at org.junit.internal.runners.statements.FailOnTimeout$StatementThread.run(FailOnTimeout.java:74)
Caused by: java.lang.ClassNotFoundException: org.apache.hadoop.util.ApplicationClassLoader$1
	at java.net.URLClassLoader$1.run(URLClassLoader.java:366)
	at java.net.URLClassLoader$1.run(URLClassLoader.java:355)
	at java.security.AccessController.doPrivileged(Native Method)
	at java.net.URLClassLoader.findClass(URLClassLoader.java:354)
	at java.lang.ClassLoader.loadClass(ClassLoader.java:425)
	at sun.misc.Launcher$AppClassLoader.loadClass(Launcher.java:308)
	at java.lang.ClassLoader.loadClass(ClassLoader.java:358)
	at org.apache.hadoop.util.ApplicationClassLoader.<clinit>(ApplicationClassLoader.java:61)
	at org.apache.hadoop.mapreduce.v2.TestMRJobs.testConfVerification(TestMRJobs.java:302)
	at org.apache.hadoop.mapreduce.v2.TestMRJobs.testConfVerificationWithClassloaderCustomClasses(TestMRJobs.java:253)
	at sun.reflect.NativeMethodAccessorImpl.invoke0(Native Method)
	at sun.reflect.NativeMethodAccessorImpl.invoke(NativeMethodAccessorImpl.java:57)
	at sun.reflect.DelegatingMethodAccessorImpl.invoke(DelegatingMethodAccessorImpl.java:43)
	at java.lang.reflect.Method.invoke(Method.java:606)
	at org.junit.runners.model.FrameworkMethod$1.runReflectiveCall(FrameworkMethod.java:47)
	at org.junit.internal.runners.model.ReflectiveCallable.run(ReflectiveCallable.java:12)
	at org.junit.runners.model.FrameworkMethod.invokeExplosively(FrameworkMethod.java:44)
	at org.junit.internal.runners.statements.InvokeMethod.evaluate(InvokeMethod.java:17)
	at org.junit.internal.runners.statements.FailOnTimeout$StatementThread.run(FailOnTimeout.java:74)


REGRESSION:  org.apache.hadoop.mapreduce.v2.TestUberAM.testConfVerificationWithOutClassloader

Error Message:
org/apache/hadoop/io/NullWritable

Stack Trace:
java.lang.NoClassDefFoundError: org/apache/hadoop/io/NullWritable
	at org.apache.hadoop.mapreduce.SleepJob.createJob(SleepJob.java:213)
	at org.apache.hadoop.mapreduce.v2.TestMRJobs.testConfVerification(TestMRJobs.java:318)
	at org.apache.hadoop.mapreduce.v2.TestMRJobs.testConfVerificationWithOutClassloader(TestMRJobs.java:258)
	at sun.reflect.NativeMethodAccessorImpl.invoke0(Native Method)
	at sun.reflect.NativeMethodAccessorImpl.invoke(NativeMethodAccessorImpl.java:57)
	at sun.reflect.DelegatingMethodAccessorImpl.invoke(DelegatingMethodAccessorImpl.java:43)
	at java.lang.reflect.Method.invoke(Method.java:606)
	at org.junit.runners.model.FrameworkMethod$1.runReflectiveCall(FrameworkMethod.java:47)
	at org.junit.internal.runners.model.ReflectiveCallable.run(ReflectiveCallable.java:12)
	at org.junit.runners.model.FrameworkMethod.invokeExplosively(FrameworkMethod.java:44)
	at org.junit.internal.runners.statements.InvokeMethod.evaluate(InvokeMethod.java:17)
	at org.junit.internal.runners.statements.FailOnTimeout$StatementThread.run(FailOnTimeout.java:74)


REGRESSION:  org.apache.hadoop.mapreduce.v2.TestUberAM.testContainerRollingLog

Error Message:
org/apache/hadoop/io/NullWritable

Stack Trace:
java.lang.NoClassDefFoundError: org/apache/hadoop/io/NullWritable
	at org.apache.hadoop.mapreduce.SleepJob.createJob(SleepJob.java:213)
	at org.apache.hadoop.mapreduce.v2.TestMRJobs.testContainerRollingLog(TestMRJobs.java:649)
	at sun.reflect.NativeMethodAccessorImpl.invoke0(Native Method)
	at sun.reflect.NativeMethodAccessorImpl.invoke(NativeMethodAccessorImpl.java:57)
	at sun.reflect.DelegatingMethodAccessorImpl.invoke(DelegatingMethodAccessorImpl.java:43)
	at java.lang.reflect.Method.invoke(Method.java:606)
	at org.junit.runners.model.FrameworkMethod$1.runReflectiveCall(FrameworkMethod.java:47)
	at org.junit.internal.runners.model.ReflectiveCallable.run(ReflectiveCallable.java:12)
	at org.junit.runners.model.FrameworkMethod.invokeExplosively(FrameworkMethod.java:44)
	at org.junit.internal.runners.statements.InvokeMethod.evaluate(InvokeMethod.java:17)
	at org.junit.internal.runners.statements.FailOnTimeout$StatementThread.run(FailOnTimeout.java:74)


REGRESSION:  org.apache.hadoop.mapreduce.v2.TestUberAM.testConfVerificationWithJobClientLocal

Error Message:
org/apache/hadoop/metrics/Updater

Stack Trace:
java.lang.NoClassDefFoundError: org/apache/hadoop/metrics/Updater
	at java.lang.ClassLoader.defineClass1(Native Method)
	at java.lang.ClassLoader.defineClass(ClassLoader.java:800)
	at java.security.SecureClassLoader.defineClass(SecureClassLoader.java:142)
	at java.net.URLClassLoader.defineClass(URLClassLoader.java:449)
	at java.net.URLClassLoader.access$100(URLClassLoader.java:71)
	at java.net.URLClassLoader$1.run(URLClassLoader.java:361)
	at java.net.URLClassLoader$1.run(URLClassLoader.java:355)
	at java.security.AccessController.doPrivileged(Native Method)
	at java.net.URLClassLoader.findClass(URLClassLoader.java:354)
	at java.lang.ClassLoader.loadClass(ClassLoader.java:425)
	at sun.misc.Launcher$AppClassLoader.loadClass(Launcher.java:308)
	at java.lang.ClassLoader.loadClass(ClassLoader.java:358)
	at org.apache.hadoop.mapred.LocalJobRunner.<init>(LocalJobRunner.java:742)
	at org.apache.hadoop.mapred.LocalJobRunner.<init>(LocalJobRunner.java:735)
	at org.apache.hadoop.mapred.LocalClientProtocolProvider.create(LocalClientProtocolProvider.java:42)
	at org.apache.hadoop.mapreduce.Cluster.initialize(Cluster.java:95)
	at org.apache.hadoop.mapreduce.Cluster.<init>(Cluster.java:82)
	at org.apache.hadoop.mapreduce.Cluster.<init>(Cluster.java:75)
	at org.apache.hadoop.mapred.JobClient.init(JobClient.java:470)
	at org.apache.hadoop.mapred.JobClient.<init>(JobClient.java:460)
	at org.apache.hadoop.mapreduce.v2.TestMRJobs.testConfVerification(TestMRJobs.java:292)
	at org.apache.hadoop.mapreduce.v2.TestMRJobs.testConfVerificationWithJobClientLocal(TestMRJobs.java:268)
	at sun.reflect.NativeMethodAccessorImpl.invoke0(Native Method)
	at sun.reflect.NativeMethodAccessorImpl.invoke(NativeMethodAccessorImpl.java:57)
	at sun.reflect.DelegatingMethodAccessorImpl.invoke(DelegatingMethodAccessorImpl.java:43)
	at java.lang.reflect.Method.invoke(Method.java:606)
	at org.junit.runners.model.FrameworkMethod$1.runReflectiveCall(FrameworkMethod.java:47)
	at org.junit.internal.runners.model.ReflectiveCallable.run(ReflectiveCallable.java:12)
	at org.junit.runners.model.FrameworkMethod.invokeExplosively(FrameworkMethod.java:44)
	at org.junit.internal.runners.statements.InvokeMethod.evaluate(InvokeMethod.java:17)
	at org.junit.internal.runners.statements.FailOnTimeout$StatementThread.run(FailOnTimeout.java:74)
Caused by: java.lang.ClassNotFoundException: org.apache.hadoop.metrics.Updater
	at java.net.URLClassLoader$1.run(URLClassLoader.java:366)
	at java.net.URLClassLoader$1.run(URLClassLoader.java:355)
	at java.security.AccessController.doPrivileged(Native Method)
	at java.net.URLClassLoader.findClass(URLClassLoader.java:354)
	at java.lang.ClassLoader.loadClass(ClassLoader.java:425)
	at sun.misc.Launcher$AppClassLoader.loadClass(Launcher.java:308)
	at java.lang.ClassLoader.loadClass(ClassLoader.java:358)
	at java.lang.ClassLoader.defineClass1(Native Method)
	at java.lang.ClassLoader.defineClass(ClassLoader.java:800)
	at java.security.SecureClassLoader.defineClass(SecureClassLoader.java:142)
	at java.net.URLClassLoader.defineClass(URLClassLoader.java:449)
	at java.net.URLClassLoader.access$100(URLClassLoader.java:71)
	at java.net.URLClassLoader$1.run(URLClassLoader.java:361)
	at java.net.URLClassLoader$1.run(URLClassLoader.java:355)
	at java.security.AccessController.doPrivileged(Native Method)
	at java.net.URLClassLoader.findClass(URLClassLoader.java:354)
	at java.lang.ClassLoader.loadClass(ClassLoader.java:425)
	at sun.misc.Launcher$AppClassLoader.loadClass(Launcher.java:308)
	at java.lang.ClassLoader.loadClass(ClassLoader.java:358)
	at org.apache.hadoop.mapred.LocalJobRunner.<init>(LocalJobRunner.java:742)
	at org.apache.hadoop.mapred.LocalJobRunner.<init>(LocalJobRunner.java:735)
	at org.apache.hadoop.mapred.LocalClientProtocolProvider.create(LocalClientProtocolProvider.java:42)
	at org.apache.hadoop.mapreduce.Cluster.initialize(Cluster.java:95)
	at org.apache.hadoop.mapreduce.Cluster.<init>(Cluster.java:82)
	at org.apache.hadoop.mapreduce.Cluster.<init>(Cluster.java:75)
	at org.apache.hadoop.mapred.JobClient.init(JobClient.java:470)
	at org.apache.hadoop.mapred.JobClient.<init>(JobClient.java:460)
	at org.apache.hadoop.mapreduce.v2.TestMRJobs.testConfVerification(TestMRJobs.java:292)
	at org.apache.hadoop.mapreduce.v2.TestMRJobs.testConfVerificationWithJobClientLocal(TestMRJobs.java:268)
	at sun.reflect.NativeMethodAccessorImpl.invoke0(Native Method)
	at sun.reflect.NativeMethodAccessorImpl.invoke(NativeMethodAccessorImpl.java:57)
	at sun.reflect.DelegatingMethodAccessorImpl.invoke(DelegatingMethodAccessorImpl.java:43)
	at java.lang.reflect.Method.invoke(Method.java:606)
	at org.junit.runners.model.FrameworkMethod$1.runReflectiveCall(FrameworkMethod.java:47)
	at org.junit.internal.runners.model.ReflectiveCallable.run(ReflectiveCallable.java:12)
	at org.junit.runners.model.FrameworkMethod.invokeExplosively(FrameworkMethod.java:44)
	at org.junit.internal.runners.statements.InvokeMethod.evaluate(InvokeMethod.java:17)
	at org.junit.internal.runners.statements.FailOnTimeout$StatementThread.run(FailOnTimeout.java:74)


REGRESSION:  org.apache.hadoop.mapreduce.v2.TestUberAM.testConfVerificationWithClassloader

Error Message:
org/apache/hadoop/io/NullWritable

Stack Trace:
java.lang.NoClassDefFoundError: org/apache/hadoop/io/NullWritable
	at org.apache.hadoop.mapreduce.SleepJob.createJob(SleepJob.java:213)
	at org.apache.hadoop.mapreduce.v2.TestMRJobs.testConfVerification(TestMRJobs.java:318)
	at org.apache.hadoop.mapreduce.v2.TestMRJobs.testConfVerificationWithClassloader(TestMRJobs.java:247)
	at sun.reflect.NativeMethodAccessorImpl.invoke0(Native Method)
	at sun.reflect.NativeMethodAccessorImpl.invoke(NativeMethodAccessorImpl.java:57)
	at sun.reflect.DelegatingMethodAccessorImpl.invoke(DelegatingMethodAccessorImpl.java:43)
	at java.lang.reflect.Method.invoke(Method.java:606)
	at org.junit.runners.model.FrameworkMethod$1.runReflectiveCall(FrameworkMethod.java:47)
	at org.junit.internal.runners.model.ReflectiveCallable.run(ReflectiveCallable.java:12)
	at org.junit.runners.model.FrameworkMethod.invokeExplosively(FrameworkMethod.java:44)
	at org.junit.internal.runners.statements.InvokeMethod.evaluate(InvokeMethod.java:17)
	at org.junit.internal.runners.statements.FailOnTimeout$StatementThread.run(FailOnTimeout.java:74)


FAILED:  org.apache.hadoop.mapreduce.v2.TestUberAM.org.apache.hadoop.mapreduce.v2.TestUberAM

Error Message:
org/apache/hadoop/service/ServiceOperations

Stack Trace:
java.lang.NoClassDefFoundError: org/apache/hadoop/service/ServiceOperations
	at org.apache.hadoop.service.CompositeService.stop(CompositeService.java:157)
	at org.apache.hadoop.service.CompositeService.serviceStop(CompositeService.java:131)
	at org.apache.hadoop.service.AbstractService.stop(AbstractService.java:221)
	at org.apache.hadoop.mapreduce.v2.TestMRJobs.tearDown(TestMRJobs.java:175)
	at sun.reflect.NativeMethodAccessorImpl.invoke0(Native Method)
	at sun.reflect.NativeMethodAccessorImpl.invoke(NativeMethodAccessorImpl.java:57)
	at sun.reflect.DelegatingMethodAccessorImpl.invoke(DelegatingMethodAccessorImpl.java:43)
	at java.lang.reflect.Method.invoke(Method.java:606)
	at org.junit.runners.model.FrameworkMethod$1.runReflectiveCall(FrameworkMethod.java:47)
	at org.junit.internal.runners.model.ReflectiveCallable.run(ReflectiveCallable.java:12)
	at org.junit.runners.model.FrameworkMethod.invokeExplosively(FrameworkMethod.java:44)
	at org.junit.internal.runners.statements.RunAfters.evaluate(RunAfters.java:33)
	at org.junit.runners.ParentRunner.run(ParentRunner.java:309)
	at org.apache.maven.surefire.junit4.JUnit4Provider.execute(JUnit4Provider.java:264)
	at org.apache.maven.surefire.junit4.JUnit4Provider.executeTestSet(JUnit4Provider.java:153)
	at org.apache.maven.surefire.junit4.JUnit4Provider.invoke(JUnit4Provider.java:124)
	at org.apache.maven.surefire.booter.ForkedBooter.invokeProviderInSameClassLoader(ForkedBooter.java:200)
	at org.apache.maven.surefire.booter.ForkedBooter.runSuitesInProcess(ForkedBooter.java:153)
	at org.apache.maven.surefire.booter.ForkedBooter.main(ForkedBooter.java:103)
Caused by: java.lang.ClassNotFoundException: org.apache.hadoop.service.ServiceOperations
	at java.net.URLClassLoader$1.run(URLClassLoader.java:366)
	at java.net.URLClassLoader$1.run(URLClassLoader.java:355)
	at java.security.AccessController.doPrivileged(Native Method)
	at java.net.URLClassLoader.findClass(URLClassLoader.java:354)
	at java.lang.ClassLoader.loadClass(ClassLoader.java:425)
	at sun.misc.Launcher$AppClassLoader.loadClass(Launcher.java:308)
	at java.lang.ClassLoader.loadClass(ClassLoader.java:358)
	at org.apache.hadoop.service.CompositeService.stop(CompositeService.java:157)
	at org.apache.hadoop.service.CompositeService.serviceStop(CompositeService.java:131)
	at org.apache.hadoop.service.AbstractService.stop(AbstractService.java:221)
	at org.apache.hadoop.mapreduce.v2.TestMRJobs.tearDown(TestMRJobs.java:175)
	at sun.reflect.NativeMethodAccessorImpl.invoke0(Native Method)
	at sun.reflect.NativeMethodAccessorImpl.invoke(NativeMethodAccessorImpl.java:57)
	at sun.reflect.DelegatingMethodAccessorImpl.invoke(DelegatingMethodAccessorImpl.java:43)
	at java.lang.reflect.Method.invoke(Method.java:606)
	at org.junit.runners.model.FrameworkMethod$1.runReflectiveCall(FrameworkMethod.java:47)
	at org.junit.internal.runners.model.ReflectiveCallable.run(ReflectiveCallable.java:12)
	at org.junit.runners.model.FrameworkMethod.invokeExplosively(FrameworkMethod.java:44)
	at org.junit.internal.runners.statements.RunAfters.evaluate(RunAfters.java:33)
	at org.junit.runners.ParentRunner.run(ParentRunner.java:309)
	at org.apache.maven.surefire.junit4.JUnit4Provider.execute(JUnit4Provider.java:264)
	at org.apache.maven.surefire.junit4.JUnit4Provider.executeTestSet(JUnit4Provider.java:153)
	at org.apache.maven.surefire.junit4.JUnit4Provider.invoke(JUnit4Provider.java:124)
	at org.apache.maven.surefire.booter.ForkedBooter.invokeProviderInSameClassLoader(ForkedBooter.java:200)
	at org.apache.maven.surefire.booter.ForkedBooter.runSuitesInProcess(ForkedBooter.java:153)
	at org.apache.maven.surefire.booter.ForkedBooter.main(ForkedBooter.java:103)



Mime
  • Unnamed multipart/mixed (inline, None, 0 bytes)
View raw message