hadoop-mapreduce-dev mailing list archives

Site index · List index
Message view « Date » · « Thread »
Top « Date » · « Thread »
From Apache Jenkins Server <jenk...@builds.apache.org>
Subject Hadoop-Mapreduce-trunk - Build # 2186 - Still Failing
Date Fri, 26 Jun 2015 14:35:39 GMT
See https://builds.apache.org/job/Hadoop-Mapreduce-trunk/2186/

###################################################################################
########################## LAST 60 LINES OF THE CONSOLE ###########################
[...truncated 31677 lines...]
Tests run: 8, Failures: 0, Errors: 0, Skipped: 0, Time elapsed: 17.382 sec - in org.apache.hadoop.mapreduce.v2.hs.TestHistoryFileManager
Running org.apache.hadoop.mapreduce.v2.hs.TestJHSDelegationTokenSecretManager
Tests run: 1, Failures: 0, Errors: 0, Skipped: 0, Time elapsed: 0.652 sec - in org.apache.hadoop.mapreduce.v2.hs.TestJHSDelegationTokenSecretManager

Results :

Tests run: 194, Failures: 0, Errors: 0, Skipped: 0

[INFO] ------------------------------------------------------------------------
[INFO] Reactor Summary:
[INFO] 
[INFO] Apache Hadoop MapReduce Client .................... SUCCESS [  2.814 s]
[INFO] Apache Hadoop MapReduce Core ...................... SUCCESS [01:31 min]
[INFO] Apache Hadoop MapReduce Common .................... SUCCESS [ 28.018 s]
[INFO] Apache Hadoop MapReduce Shuffle ................... SUCCESS [  4.954 s]
[INFO] Apache Hadoop MapReduce App ....................... SUCCESS [08:54 min]
[INFO] Apache Hadoop MapReduce HistoryServer ............. FAILURE [05:34 min]
[INFO] Apache Hadoop MapReduce JobClient ................. SKIPPED
[INFO] Apache Hadoop MapReduce HistoryServer Plugins ..... SKIPPED
[INFO] Apache Hadoop MapReduce NativeTask ................ SKIPPED
[INFO] Apache Hadoop MapReduce Examples .................. SKIPPED
[INFO] Apache Hadoop MapReduce ........................... SKIPPED
[INFO] ------------------------------------------------------------------------
[INFO] BUILD FAILURE
[INFO] ------------------------------------------------------------------------
[INFO] Total time: 16:37 min
[INFO] Finished at: 2015-06-26T14:35:27+00:00
[INFO] Final Memory: 45M/815M
[INFO] ------------------------------------------------------------------------
[ERROR] Failed to execute goal org.apache.maven.plugins:maven-surefire-plugin:2.17:test (default-test)
on project hadoop-mapreduce-client-hs: ExecutionException: java.lang.RuntimeException: The
forked VM terminated without properly saying goodbye. VM crash or System.exit called?
[ERROR] Command was /bin/sh -c cd /home/jenkins/jenkins-slave/workspace/Hadoop-Mapreduce-trunk/hadoop-mapreduce-project/hadoop-mapreduce-client/hadoop-mapreduce-client-hs
&& /home/jenkins/tools/java/jdk1.7.0_55/jre/bin/java -Xmx4096m -XX:MaxPermSize=768m
-XX:+HeapDumpOnOutOfMemoryError -jar /home/jenkins/jenkins-slave/workspace/Hadoop-Mapreduce-trunk/hadoop-mapreduce-project/hadoop-mapreduce-client/hadoop-mapreduce-client-hs/target/surefire/surefirebooter1513322079588387786.jar
/home/jenkins/jenkins-slave/workspace/Hadoop-Mapreduce-trunk/hadoop-mapreduce-project/hadoop-mapreduce-client/hadoop-mapreduce-client-hs/target/surefire/surefire4440227696542859430tmp
/home/jenkins/jenkins-slave/workspace/Hadoop-Mapreduce-trunk/hadoop-mapreduce-project/hadoop-mapreduce-client/hadoop-mapreduce-client-hs/target/surefire/surefire_1274585111660372478623tmp
[ERROR] -> [Help 1]
[ERROR] 
[ERROR] To see the full stack trace of the errors, re-run Maven with the -e switch.
[ERROR] Re-run Maven using the -X switch to enable full debug logging.
[ERROR] 
[ERROR] For more information about the errors and possible solutions, please read the following
articles:
[ERROR] [Help 1] http://cwiki.apache.org/confluence/display/MAVEN/MojoFailureException
[ERROR] 
[ERROR] After correcting the problems, you can resume the build with the command
[ERROR]   mvn <goals> -rf :hadoop-mapreduce-client-hs
Build step 'Execute shell' marked build as failure
[FINDBUGS] Skipping publisher since build result is FAILURE
Archiving artifacts
Sending artifact delta relative to Hadoop-Mapreduce-trunk #2161
Archived 1 artifacts
Archive block size is 32768
Received 0 blocks and 20399114 bytes
Compression is 0.0%
Took 7.2 sec
Recording test results
Updating HADOOP-11203
Updating MAPREDUCE-6413
Updating HDFS-8665
Updating HDFS-8462
Updating HDFS-8640
Updating HDFS-8546
Email was triggered for: Failure
Sending email for trigger: Failure



###################################################################################
############################## FAILED TESTS (if any) ##############################
All tests passed
Mime
  • Unnamed multipart/mixed (inline, None, 0 bytes)
View raw message